{"text_format":"3","workbook":"xlsx","n_sheets":8,"sheets":["Unit Info","Master PO Schedule","PO - Instr - Rm List","In-year Trg Plan","Weekly Trg","Other Activities","Duty Pers","Routine Order"],"not_rendered":{"macros":1,"defined_names":8},"read":"whole","date_system":"1900"}

{"sheet":"Unit Info","index":0,"n_rows":26,"n_cols":4,"rows_kept":26,"merged":[[0,1,0,3],[3,1,3,2],[11,1,11,2],[13,1,13,2],[16,0,16,3],[17,1,17,3],[18,1,18,3],[20,0,23,3],[25,0,29,3]]}
["Corps Name","748 Army RCACC"]
[]
["Times:","Start","Finish","Format"]
["Arrival","18:30:00",null,"(HH:mm)"]
["Fall-In/Opening","18:40:00","18:55:00","(HH:mm)"]
["Period One","19:00:00","19:45:00","(HH:mm)"]
{"$rows_left_out":21}
{"sheet":"Master PO Schedule","index":1,"n_rows":19,"n_cols":48,"rows_kept":19,"merged":[[1,0,3,0],[4,0,6,0],[7,0,9,0],[10,0,12,0],[13,0,15,0]]}
[null,"Period","Week No.",1,2,3,4,5,6,7,8,9,10,11,12,13,14,15,16,17,18,19,20,21,22,23,24,25,26,27,28,29,30,31,32,33,34,35,36,37,38,39,40,41,42,43,44,45]
["Green Star",1,"PO.EO:","Admin","M-108.01","CX05.01","M-121.01b","M-121.03a","M-121.03c","M-121.05","M-108.03","M-108.05","M-108.07","M-107.01","C-107.02","CX05.01","Christmas","Christmas","Christmas","M-107.05a","M-107.05a","Stand Down","C-107.02","CX20.01","M-122.01","CX05.01","M-122.03","CX05.01","M-122.03","March Break","CO Parade","C-122.01a","C-122.01d","C-122.01g","C-122.01j","M-122.05b","M-122.05b","M108.01","M108.04","M108.08","M108.11"]
[null,2,"PO.EO:","Admin","M-108.02","CX05.01","M-121.02a","M-121.03b","M-121.04","M-121.06","M-108.04","M-108.06","M-108.08","M-107.03","C-107.04","CX05.01","Christmas","Christmas","Christmas","M-107.05b","M-107.05b","Stand Down","C-107.04","CX20.01","M-122.02a","CX05.01","M-122.04","CX05.01","M-122.04","March Break","C-122.01a","C-122.01b","C-122.01e","C-122.01h","C-122.01k","C-122.01l","C-122.01l","M108.02","M108.05","M108.09","M108.12"]
[null,3,"PO.EO:","Admin","M-121.01a","CX05.01","M-121.02b","M-PSRY.01a","M-PSRY.01b","M-PSRY.02","M-PSRY.03","M-PSRY.04a","M-PSRY.04b","M-107.04","M-103.01","CX05.01","Christmas","Christmas","Christmas","M-107.06","M-107.06","Stand Down","M-103.01","CX20.01","M-122.02b","CX05.01","M-123.01","CX05.01","M-123.01","March Break","C-122.01b","C-122.01c","C-122.01f","C-122.01i","M-122.05a","C-103.01","C-103.01","M108.03","M108.07","M108.10","M108.12"]
["Red Star",1,"PO.EO:","Admin","M-224.01a","CX05.01","C-224.02a","M-221.01","M-221.03a","M-221.05a","M-221.09a","M-208.01a","C-108.01a","C-207.01","M-203.01","CX05.01","Christmas","Christmas","Christmas","C-206.02a","C-206.02a","Stand Down","M-203.01","MX20.01D","MX20.01G","CX05.01","M-203.01","CX05.01","M-203.01","March Break","CO Parade","M222.01","M222.04","M223.01","M224.01","M224.04","M224.04","C208.01","C208.01","C208.01","C208.01"]
[null,2,"PO.EO:","Admin","M-224.01b","CX05.01","C-224.02b","M-221.02a","M-221.03b","M-221.05b","M-221.09b","M-208.01b","C-108.01b","M-207.03","M-203.02","CX05.01","Christmas","Christmas","Christmas","C-206.02b","C-206.02b","Stand Down","M-203.02","MX20.01E","MX01.01A","CX05.01","M-203.02","CX05.01","M-203.02","March Break","M222.01","M222.02","M222.05","M223.02","M224.02","M224.05","M224.05","C208.01","C208.01","C208.01","C208.01"]
{"$rows_left_out":14}
{"sheet":"PO - Instr - Rm List","index":2,"n_rows":160,"n_cols":29,"rows_kept":160}
["NOTE:",null,"Additional classes or activities may be added, but each table must be sorted smallest to largest by the \"PO/EO No.\" column for the look-up function to polpulate the In-Year Training Plan (Under 'Review', Unprotect Sheet, the password is 'Password').",{"$nulls":14},"The PO Root column has been provided as a means to sort POs together for assigning instructors, training locations, etc."]
["Green Star",{"$nulls":5},"Red Star",{"$nulls":5},"Silver Star",{"$nulls":5},"Gold Star",{"$nulls":5},"Master Cadet"]
["PO/EO No.","PO Root","PO Title","Green Star Instructor","Green Star Location",null,"PO/EO No.","PO Root","PO Title","Red Star Instructor","Red Star Location",null,"PO/EO No.","PO Root","PO Title","Silver Star Instructor","Silver Star Location",null,"PO/EO No.","PO Root","PO Title","Gold Star Instructor","Gold Star Location",null,"PO/EO No.","PO Root","PO Title","Master Cadet Instructor","Master Cadet Location"]
[100,"00","PSRY Training",{"$nulls":3},"ACR",null,"Annual Review",{"$nulls":3},"303 PC","03","Leadership PC",{"$nulls":3},400,"00","PSRY Training",{"$nulls":3},"502 PC","02","Citizenship PC"]
["ACR",null,"Annual Review",{"$nulls":3},"C106.01","06","Marksmanship",{"$nulls":3},"308 PC","08","Drill PC",{"$nulls":3},"403 PC","03","Leadership PC",{"$nulls":3},"502 PC","02","Community Svc PC"]
["C103.01","03","Leadership",{"$nulls":3},"C107.03","07","GCK",{"$nulls":3},"309 PC","09","IT PC",{"$nulls":3},"408 PC","08","Drill PC",{"$nulls":3},"503 PC","03","Leadership PC"]
{"$rows_left_out":155}
{"sheet":"In-year Trg Plan","index":3,"n_rows":133,"n_cols":48,"rows_kept":133,"merged":[[4,0,15,0],[4,1,7,1],[8,1,11,1],[12,1,15,1],[16,0,27,0],[16,1,19,1],[20,1,23,1],[24,1,27,1],[28,0,39,0],[28,1,31,1],[32,1,35,1],[36,1,39,1],[40,0,51,0],[40,1,43,1],[44,1,47,1],[48,1,51,1],[52,0,63,0],[52,1,55,1],[56,1,59,1],[60,1,63,1],[68,4,68,5]]}
[]
[]
[null,null,"RO No.",{"$f":"IF(AND(MONTH(D4)=1,_xlfn.ISOWEEKNUM(D4)=52),CONCATENATE(TEXT(D4-365,\"yy\"),\"-\",TEXT(_xlfn.ISOWEEKNUM(D4),\"00#\")),CONCATENATE(TEXT(D4,\"yy\"),\"-\",TEXT(_xlfn.ISOWEEKNUM(D4),\"00#\")))","v":"19-037"},{"$f":"IF(AND(MONTH(E4)=1,_xlfn.ISOWEEKNUM(E4)=52),CONCATENATE(TEXT(E4-365,\"yy\"),\"-\",TEXT(_xlfn.ISOWEEKNUM(E4),\"00#\")),CONCATENATE(TEXT(E4,\"yy\"),\"-\",TEXT(_xlfn.ISOWEEKNUM(E4),\"00#\")))","v":"19-038"},"19-039","19-040","19-041","19-042","19-043","19-045","19-046","19-047","19-048","19-049","19-050","19-051","19-052","20-001","20-002","20-003","20-004","20-005","20-006","20-007","20-008","20-009","20-010","20-011","20-012","20-013","20-014","20-015","20-016","20-017","20-018","20-019","20-020","20-021","20-022","20-023","20-024","20-025","20-026","20-027","20-028","20-029","20-030"]
[null,null,"Date",{"$f":"IF(ISBLANK('Unit Info'!$B$14),\"\",'Unit Info'!$B$14)","v":"2019-09-12"},{"$f":"D4+7","v":"2019-09-19"},{"$f":"E4+7","v":"2019-09-26"},"2019-10-03","2019-10-10","2019-10-17","2019-10-24","2019-11-07","2019-11-14","2019-11-21","2019-11-28","2019-12-05","2019-12-12","2019-12-19","2019-12-26","2020-01-02","2020-01-09","2020-01-16","2020-01-23","2020-01-30","2020-02-06","2020-02-13","2020-02-20","2020-02-27","2020-03-05","2020-03-12","2020-03-19","2020-03-26","2020-04-02","2020-04-09","2020-04-16","2020-04-23","2020-04-30","2020-05-07","2020-05-14","2020-05-21","2020-05-28","2020-06-04","2020-06-11","2020-06-18","2020-06-25","2020-07-02","2020-07-09","2020-07-16","2020-07-23"]
["Green Star",1,"PO/EO No.",{"$f":"'Master PO Schedule'!D2","v":"Admin"},{"$f":"'Master PO Schedule'!E2","v":"M-108.01"},{"$f":"'Master PO Schedule'!F2","v":"CX05.01"},{"$f":"'Master PO Schedule'!G2","v":"M-121.01b"},{"$f":"'Master PO Schedule'!H2","v":"M-121.03a"},{"$f":"'Master PO Schedule'!I2","v":"M-121.03c"},{"$f":"'Master PO Schedule'!J2","v":"M-121.05"},{"$f":"'Master PO Schedule'!K2","v":"M-108.03"},{"$f":"'Master PO Schedule'!L2","v":"M-108.05"},{"$f":"'Master PO Schedule'!M2","v":"M-108.07"},{"$f":"'Master PO Schedule'!N2","v":"M-107.01"},{"$f":"'Master PO Schedule'!O2","v":"C-107.02"},{"$f":"'Master PO Schedule'!P2","v":"CX05.01"},{"$f":"'Master PO Schedule'!Q2","v":"Christmas"},{"$f":"'Master PO Schedule'!R2","v":"Christmas"},{"$f":"'Master PO Schedule'!S2","v":"Christmas"},{"$f":"'Master PO Schedule'!T2","v":"M-107.05a"},{"$f":"'Master PO Schedule'!U2","v":"M-107.05a"},{"$f":"'Master PO Schedule'!V2","v":"Stand Down"},{"$f":"'Master PO Schedule'!W2","v":"C-107.02"},{"$f":"'Master PO Schedule'!X2","v":"CX20.01"},{"$f":"'Master PO Schedule'!Y2","v":"M-122.01"},{"$f":"'Master PO Schedule'!Z2","v":"CX05.01"},{"$f":"'Master PO Schedule'!AA2","v":"M-122.03"},{"$f":"'Master PO Schedule'!AB2","v":"CX05.01"},{"$f":"'Master PO Schedule'!AC2","v":"M-122.03"},{"$f":"'Master PO Schedule'!AD2","v":"March Break"},{"$f":"'Master PO Schedule'!AE2","v":"CO Parade"},{"$f":"'Master PO Schedule'!AF2","v":"C-122.01a"},{"$f":"'Master PO Schedule'!AG2","v":"C-122.01d"},{"$f":"'Master PO Schedule'!AH2","v":"C-122.01g"},{"$f":"'Master PO Schedule'!AI2","v":"C-122.01j"},{"$f":"'Master PO Schedule'!AJ2","v":"M-122.05b"},{"$f":"'Master PO Schedule'!AK2","v":"M-122.05b"},{"$f":"'Master PO Schedule'!AL2","v":"M108.01"},{"$f":"'Master PO Schedule'!AM2","v":"M108.04"},{"$f":"'Master PO Schedule'!AN2","v":"M108.08"},{"$f":"'Master PO Schedule'!AO2","v":"M108.11"},{"$f":"'Master PO Schedule'!AP2","v":{"v":0,"d":"0.00"}},{"$f":"'Master PO Schedule'!AQ2","v":{"v":0,"d":"0.00"}},{"$f":"'Master PO Schedule'!AR2","v":{"v":0,"d":"0.00"}},{"$f":"'Master PO Schedule'!AS2","v":{"v":0,"d":"0.00"}},{"$f":"'Master PO Schedule'!AT2","v":{"v":0,"d":"0.00"}},{"$f":"'Master PO Schedule'!AU2","v":{"v":0,"d":"0.00"}},{"$f":"'Master PO Schedule'!AV2","v":{"v":0,"d":"0.00"}}]
[null,null,"PO Title",{"$f":"VLOOKUP(D$5,Year_One[],3)","v":"Annual Review"},{"$f":"VLOOKUP(E$5,Year_One[],3)","v":"Drill"},{"$f":"VLOOKUP(F$5,Year_One[],3)","v":"Physical Activities"},{"$f":"VLOOKUP(G$5,Year_One[],3)","v":"Field Training"},{"$f":"VLOOKUP(H$5,Year_One[],3)","v":"Field Training"},{"$f":"VLOOKUP(I$5,Year_One[],3)","v":"Field Training"},{"$f":"VLOOKUP(J$5,Year_One[],3)","v":"Field Training"},{"$f":"VLOOKUP(K$5,Year_One[],3)","v":"Drill"},{"$f":"VLOOKUP(L$5,Year_One[],3)","v":"Drill"},{"$f":"VLOOKUP(M$5,Year_One[],3)","v":"Drill"},{"$f":"VLOOKUP(N$5,Year_One[],3)","v":"GCK"},{"$f":"VLOOKUP(O$5,Year_One[],3)","v":"GCK"},{"$f":"VLOOKUP(P$5,Year_One[],3)","v":"Physical Activities"},{"$f":"VLOOKUP(Q$5,Year_One[],3)","v":"No Training"},{"$f":"VLOOKUP(R$5,Year_One[],3)","v":"No Training"},{"$f":"VLOOKUP(S$5,Year_One[],3)","v":"No Training"},{"$f":"VLOOKUP(T$5,Year_One[],3)","v":"GCK"},{"$f":"VLOOKUP(U$5,Year_One[],3)","v":"GCK"},{"$f":"VLOOKUP(V$5,Year_One[],3)","v":{"v":0,"d":"0.00"}},{"$f":"VLOOKUP(W$5,Year_One[],3)","v":"GCK"},{"$f":"VLOOKUP(X$5,Year_One[],3)","v":"CAF Famil"},{"$f":"VLOOKUP(Y$5,Year_One[],3)","v":"Navigation"},{"$f":"VLOOKUP(Z$5,Year_One[],3)","v":"Physical Activities"},{"$f":"VLOOKUP(AA$5,Year_One[],3)","v":"Navigation"},{"$f":"VLOOKUP(AB$5,Year_One[],3)","v":"Physical Activities"},{"$f":"VLOOKUP(AC$5,Year_One[],3)","v":"Navigation"},{"$f":"VLOOKUP(AD$5,Year_One[],3)","v":"No Training"},{"$f":"VLOOKUP(AE$5,Year_One[],3)","v":"CO's Parade"},{"$f":"VLOOKUP(AF$5,Year_One[],3)","v":"Navigation"},{"$f":"VLOOKUP(AG$5,Year_One[],3)","v":"Navigation"},{"$f":"VLOOKUP(AH$5,Year_One[],3)","v":"Navigation"},{"$f":"VLOOKUP(AI$5,Year_One[],3)","v":"Navigation"},{"$f":"VLOOKUP(AJ$5,Year_One[],3)","v":"Navigation"},{"$f":"VLOOKUP(AK$5,Year_One[],3)","v":"Navigation"},{"$f":"VLOOKUP(AL$5,Year_One[],3)","v":"Drill"},{"$f":"VLOOKUP(AM$5,Year_One[],3)","v":"Drill"},{"$f":"VLOOKUP(AN$5,Year_One[],3)","v":"Drill"},{"$f":"VLOOKUP(AO$5,Year_One[],3)","v":"Drill"},{"$f":"VLOOKUP(AP$5,Year_One[],3)","v":{"$error":"#N/A"}},{"$f":"VLOOKUP(AQ$5,Year_One[],3)","v":{"$error":"#N/A"}},{"$f":"VLOOKUP(AR$5,Year_One[],3)","v":{"$error":"#N/A"}},{"$f":"VLOOKUP(AS$5,Year_One[],3)","v":{"$error":"#N/A"}},{"$f":"VLOOKUP(AT$5,Year_One[],3)","v":{"$error":"#N/A"}},{"$f":"VLOOKUP(AU$5,Year_One[],3)","v":{"$error":"#N/A"}},{"$f":"VLOOKUP(AV$5,Year_One[],3)","v":{"$error":"#N/A"}}]
{"$rows_left_out":128}
{"sheet":"Weekly Trg","index":4,"n_rows":102,"n_cols":14,"rows_kept":102}
["This table is for listing recurring weekly training / events such as Admin nights, Sports, Band, Drill Team, etc."]
["It works best in Routine Order if this list is sorted first by \"Start Time\" and then sorted by \"Sort Order\" column to right."]
["Beginning (first occurrence in d mmm yy)","Ending       (final occurrence in d mmm yy)","Day (Auto-fills)","Start Time (HH:mm)","End Time (HH:mm)","Activity","Column1","Column2","Location","Column3","Dress","OPI","Sort Order","Sort Calculation"]
["2019-09-16","2020-02-10",{"$f":"IF(ISBLANK(A4),\"\",TEXT(A4,\"DDD\"))","v":"Mon"},"16:00:00","18:30:00","Marksmanship Team Practice",null,null,"MDVA",null,"Civvies","Capt. Carlsen",{"$f":"IF(ISBLANK(Table1[[#This Row],[Beginning (first occurrence in d mmm yy)]]),\"\",N4)","v":4},{"$f":"IF(ISBLANK('Weekly Trg'!A4),8,IF(WEEKDAY('Weekly Trg'!A4,1)>WEEKDAY('Unit Info'!$B$14,1),WEEKDAY('Weekly Trg'!A4,1)-WEEKDAY('Unit Info'!$B$14,1),WEEKDAY('Weekly Trg'!A4,1)+7-WEEKDAY('Unit Info'!$B$14,1)))","v":4}]
["2020-03-30","2020-05-25","Mon","16:00:00","18:30:00","Drill Practice",null,null,"MDVA",null,"Civvies","Capt. Carlsen",{"$f":"IF(ISBLANK(Table1[[#This Row],[Beginning (first occurrence in d mmm yy)]]),\"\",N5)","v":4},{"$f":"IF(ISBLANK('Weekly Trg'!A5),8,IF(WEEKDAY('Weekly Trg'!A5,1)>WEEKDAY('Unit Info'!$B$14,1),WEEKDAY('Weekly Trg'!A5,1)-WEEKDAY('Unit Info'!$B$14,1),WEEKDAY('Weekly Trg'!A5,1)+7-WEEKDAY('Unit Info'!$B$14,1)))","v":4}]
[null,null,"",{"$nulls":9},{"$f":"IF(ISBLANK(Table1[[#This Row],[Beginning (first occurrence in d mmm yy)]]),\"\",N6)","v":""},{"$f":"IF(ISBLANK('Weekly Trg'!A6),8,IF(WEEKDAY('Weekly Trg'!A6,1)>WEEKDAY('Unit Info'!$B$14,1),WEEKDAY('Weekly Trg'!A6,1)-WEEKDAY('Unit Info'!$B$14,1),WEEKDAY('Weekly Trg'!A6,1)+7-WEEKDAY('Unit Info'!$B$14,1)))","v":8}]
{"$rows_left_out":78}
{"sheet":"Other Activities","index":5,"n_rows":102,"n_cols":22,"rows_kept":102,"merged":[[1,0,1,5],[1,12,1,13],[1,14,1,15],[11,20,16,22]]}
["Enter activity finish date only if different than start date.  Activities beyond 48 hrs will be counted as two supported days, not generally to exceed 5 meals."]
["Enter dates in d mmm yy format and times in HH:mm (24 Hour Clock)",{"$nulls":11},"QM Support Required",null,"Expected Participants"]
["Activity Start Date","Day","Start Time","Activity End Date (if different than start)","Finish Time","Activity Name or Description","Location","Dress","OPI","Supported (Yes/No)","Out of Region? (Yes/No)","Type of Supported Day (see side note)","General Stores (Pots, stoves, etc)  (Y/N)","Sleeping Bags, Tents, Mattresses  (Y/N)","Cadets","Staff","Activity Request Due","Total Expected"]
["2019-09-27",{"$f":"IF(A4<>\"\",TEXT(A4,\"ddd\"),\"\")","v":"Fri"},"18:00:00","2019-09-29","14:00:00","Biv / Survival FTX","Woodland Trails Scout Camp","FTU","2Lt Chen","Y","N","Bivouac FTX","Y","N",50,4,{"$f":"IF(ISBLANK(A4),\"\",IF(AND(ISBLANK(J4),ISBLANK(K4)),\"\",IF(AND(OR(J4=\"No\",J4=\"n\"),OR(K4=\"No\",K4=\"n\")),\"\",IF(OR(K4=\"YES\",K4=\"y\"),A4-105,IF(OR(J4=\"yes\",J4=\"y\"),A4-45,\"Check entry\")))))","v":"2019-08-13"},{"$f":"SUM(O4:P4)","v":54}]
["2019-09-27","Fri","18:00:00","2019-09-29","18:00:00","Silver / Gold Star CES","CES",null,null,"N","N",{"$nulls":3},15,null,"",15]
["2019-10-05","Sat","08:00:00","2019-10-05","16:00:00","GGHG Change of Command Practice Day","Denison Armoury","FTU","Lt Heaton","N","N",{"$nulls":3},30,1,"",31,null,"Type of Supported Day, Refer To QSP:"]
{"$rows_left_out":97}
{"sheet":"Duty Pers","index":6,"n_rows":47,"n_cols":10,"rows_kept":47}
[null,null,"Enter the title(s) of up to seven duty positions into the header bar (Row 2) of any of the seven columns (C-I), then list the names of the assigned duty person in the rows below corresponding to the appropriate date."]
["Week / RO No.","Date","Duty Officer","Duty NCO","Duty NCM",{"$nulls":4},"Notes"]
[{"$f":"IF(AND(MONTH(B3)=1,_xlfn.ISOWEEKNUM(B3)=52),CONCATENATE(TEXT(B3-365,\"yy\"),\"-\",TEXT(_xlfn.ISOWEEKNUM(B3),\"00#\")),CONCATENATE(TEXT(B3,\"yy\"),\"-\",TEXT(_xlfn.ISOWEEKNUM(B3),\"00#\")))","v":"19-037"},{"$f":"'In-year Trg Plan'!D$4","v":"2019-09-12"},"Capt Stagg","RSM"]
[{"$f":"IF(AND(MONTH(B4)=1,_xlfn.ISOWEEKNUM(B4)=52),CONCATENATE(TEXT(B4-365,\"yy\"),\"-\",TEXT(_xlfn.ISOWEEKNUM(B4),\"00#\")),CONCATENATE(TEXT(B4,\"yy\"),\"-\",TEXT(_xlfn.ISOWEEKNUM(B4),\"00#\")))","v":"19-038"},{"$f":"'In-year Trg Plan'!E$4","v":"2019-09-19"},"2Lt Chen","DSM"]
["19-039",{"$f":"'In-year Trg Plan'!F$4","v":"2019-09-26"},"Lt Heaton","RSM"]
["19-040",{"$f":"'In-year Trg Plan'!G$4","v":"2019-10-03"},"Capt Carlsen","DSM"]
{"$rows_left_out":42}
{"sheet":"Routine Order","index":7,"n_rows":119,"n_cols":15,"rows_kept":119,"merged":[[0,0,0,11],[1,0,1,11],[4,8,4,11],[6,8,6,11],[8,8,8,11],[10,0,10,1],[10,8,10,11],[11,0,11,2],[11,3,11,4],[12,0,12,2],[12,8,12,11],[14,8,14,11],[16,8,16,11],[18,8,18,11],[19,0,19,2],[19,3,19,4],[19,8,19,11],[21,0,21,11],[23,2,23,4],[23,5,23,7],[23,8,23,11],[24,8,24,9],[25,0,28,0],[25,2,25,4],[25,5,25,7],[25,8,25,11],[26,2,26,4],[26,5,26,7],[26,8,26,11],[27,2,27,4],[27,5,27,7],[27,8,27,11],[28,2,28,4],[28,5,28,7],[28,8,28,11],[29,0,32,0],[29,2,29,4],[29,5,29,7],[29,8,29,11],[30,2,30,4],[30,5,30,7],[30,8,30,11],[31,2,31,4],[31,5,31,7],[31,8,31,11],[32,2,32,4],[32,5,32,7],[32,8,32,11],[33,0,36,0],[33,2,33,4],[33,5,33,7],[33,8,33,11],[34,2,34,4],[34,5,34,7],[34,8,34,11],[35,2,35,4],[35,5,35,7],[35,8,35,11],[36,2,36,4],[36,5,36,7],[36,8,36,11],[37,0,40,0],[37,2,37,4],[37,5,37,7],[37,8,37,11],[38,2,38,4],[38,5,38,7],[38,8,38,11],[39,2,39,4],[39,5,39,7],[39,8,39,11],[40,2,40,4],[40,5,40,7],[40,8,40,11],[41,0,44,0],[41,2,41,4],[41,5,41,7],[41,8,41,11],[42,2,42,4],[42,5,42,7],[42,8,42,11],[43,2,43,4],[43,5,43,7],[43,8,43,11],[44,2,44,4],[44,5,44,7],[44,8,44,11],[46,0,46,11],[48,4,48,6],[48,7,48,8],[48,10,48,11],[48,14,63,15],[49,4,49,6],[49,7,49,8],[49,10,49,11],[50,4,50,6],[50,7,50,8],[50,10,50,11],[51,4,51,6],[51,7,51,8],[51,10,51,11],[52,4,52,6],[52,7,52,8],[52,10,52,11],[53,4,53,6],[53,7,53,8],[53,10,53,11],[54,4,54,6],[54,7,54,8],[54,10,54,11],[55,4,55,6],[55,7,55,8],[55,10,55,11],[56,4,56,6],[56,7,56,8],[56,10,56,11],[57,4,57,6],[57,7,57,8],[57,10,57,11],[58,4,58,6],[58,7,58,8],[58,10,58,11],[59,4,59,6],[59,7,59,8],[59,10,59,11],[60,4,60,6],[60,7,60,8],[60,10,60,11],[61,4,61,6],[61,7,61,8],[61,10,61,11],[62,4,62,6],[62,7,62,8],[62,10,62,11],[63,4,63,6],[63,7,63,8],[63,10,63,11],[66,0,66,11],[68,0,68,1],[68,2,68,3],[68,4,68,6],[68,7,68,8],[68,10,68,11],[69,4,69,6],[69,7,69,8],[69,10,69,11],[70,4,70,6],[70,7,70,8],[70,10,70,11],[71,4,71,6],[71,7,71,8],[71,10,71,11],[72,4,72,6],[72,7,72,8],[72,10,72,11],[73,4,73,6],[73,7,73,8],[73,10,73,11],[74,4,74,6],[74,7,74,8],[74,10,74,11],[75,4,75,6],[75,7,75,8],[75,10,75,11],[76,4,76,6],[76,7,76,8],[76,10,76,11],[77,4,77,6],[77,7,77,8],[77,10,77,11],[78,4,78,6],[78,7,78,8],[78,10,78,11],[79,4,79,6],[79,7,79,8],[79,10,79,11],[80,4,80,6],[80,7,80,8],[80,10,80,11],[81,4,81,6],[81,7,81,8],[81,10,81,11],[82,4,82,6],[82,7,82,8],[82,10,82,11],[83,4,83,6],[83,7,83,8],[83,10,83,11],[85,0,85,11],[87,0,87,11],[88,0,88,11],[89,0,89,11],[90,0,90,11],[91,0,91,11],[92,0,92,11],[93,0,93,11],[94,0,94,11],[95,0,95,11],[96,0,96,11],[97,0,97,11],[98,0,98,11],[99,0,99,11],[100,0,100,11],[101,0,101,11],[102,0,102,11],[103,0,103,11],[104,0,104,11],[105,0,105,11],[106,0,106,11],[107,0,107,11],[108,0,108,11],[109,0,109,11],[110,0,110,11]]}
[{"$f":"'Unit Info'!$B$1","v":"748 Army RCACC"}]
["Weekly Routine Orders"]
["Date:",{"$f":"IF(ISBLANK($C$3),\"Enter RO date (d mmm yy):\",(TEXT($C$3,\"ddd\")))","v":"Thu"},"2020-03-26",{"$nulls":6},"RO No.",null,{"$f":"IF(AND(MONTH($C$3)=1,_xlfn.ISOWEEKNUM($C$3)=52),CONCATENATE(TEXT($C$3-365,\"yy\"),\"-\",TEXT(_xlfn.ISOWEEKNUM($C$3),\"00#\")),CONCATENATE(TEXT($C$3,\"yy\"),\"-\",TEXT(_xlfn.ISOWEEKNUM($C$3),\"00#\")))","v":"20-013"}]
[]
["CAF Member Dress:",null,{"$f":"HLOOKUP($C$3,'In-year Trg Plan'!$D$4:$AV$67,63,FALSE)","v":"1A"},{"$nulls":4},"Duty Personnel:"]
[]
{"$rows_left_out":78}