{"text_format":"3","workbook":"xlsx","n_sheets":8,"sheets":["Unit Info","Master PO Schedule","PO - Instr - Rm List","In-year Trg Plan","Weekly Trg","Other Activities","Duty Pers","Routine Order"],"not_rendered":{"macros":1,"defined_names":8},"read":"whole","date_system":"1900"}

{"sheet":"Unit Info","index":0,"n_rows":26,"n_cols":4,"rows_kept":26,"merged":[[0,1,0,3],[3,1,3,2],[11,1,11,2],[13,1,13,2],[16,0,16,3],[17,1,17,3],[18,1,18,3],[20,0,23,3],[25,0,29,3]]}
["Corps Name","748 Army RCACC"]
[]
["Times:","Start","Finish","Format"]
["Arrival","18:30:00",null,"(HH:mm)"]
["Fall-In/Opening","18:40:00","18:55:00","(HH:mm)"]
["Period One","19:00:00","19:45:00","(HH:mm)"]
["Break","19:45:00","19:59:00","(HH:mm)"]
["Period Two","20:00:00","20:45:00","(HH:mm)"]
["Break","20:46:00","20:59:00","(HH:mm)"]
["Period Three","21:00:00","21:45:00","(HH:mm)"]
["Fall-In/Closing","21:46:00","22:00:00","(HH:mm)"]
["Dismissal Time","22:00:00",null,"(HH:mm)"]
[]
["Date of First Regular Trg Night","2019-09-12",null,"(d mmm yy)"]
["Day of week for Reg Trg",{"$f":"IF(ISBLANK(B14),\"(Auto-fills)\",TEXT(B14,\"dddd\"))","v":"Thursday"}]
[]
["Commanding Officer Information"]
["Name","Roger Carlsen, CD"]
["Rank","Captain"]
[]
["To avoid accidental changes, all sheets in this workbook have the non data entry cells 'protected'. To  'unprotect' cells to make changes, select 'unprotect sheet' within the 'review' tab.  The password is 'Password'."]
[]
[]
[]
[]
["Only fill in the areas in white!!!"]

{"sheet":"Master PO Schedule","index":1,"n_rows":19,"n_cols":48,"rows_kept":19,"merged":[[1,0,3,0],[4,0,6,0],[7,0,9,0],[10,0,12,0],[13,0,15,0]]}
[null,"Period","Week No.",1,2,3,4,5,6,7,8,9,10,11,12,13,14,15,16,17,18,19,20,21,22,23,24,25,26,27,28,29,30,31,32,33,34,35,36,37,38,39,40,41,42,43,44,45]
["Green Star",1,"PO.EO:","Admin","M-108.01","CX05.01","M-121.01b","M-121.03a","M-121.03c","M-121.05","M-108.03","M-108.05","M-108.07","M-107.01","C-107.02","CX05.01","Christmas","Christmas","Christmas","M-107.05a","M-107.05a","Stand Down","C-107.02","CX20.01","M-122.01","CX05.01","M-122.03","CX05.01","M-122.03","March Break","CO Parade","C-122.01a","C-122.01d","C-122.01g","C-122.01j","M-122.05b","M-122.05b","M108.01","M108.04","M108.08","M108.11"]
[null,2,"PO.EO:","Admin","M-108.02","CX05.01","M-121.02a","M-121.03b","M-121.04","M-121.06","M-108.04","M-108.06","M-108.08","M-107.03","C-107.04","CX05.01","Christmas","Christmas","Christmas","M-107.05b","M-107.05b","Stand Down","C-107.04","CX20.01","M-122.02a","CX05.01","M-122.04","CX05.01","M-122.04","March Break","C-122.01a","C-122.01b","C-122.01e","C-122.01h","C-122.01k","C-122.01l","C-122.01l","M108.02","M108.05","M108.09","M108.12"]
[null,3,"PO.EO:","Admin","M-121.01a","CX05.01","M-121.02b","M-PSRY.01a","M-PSRY.01b","M-PSRY.02","M-PSRY.03","M-PSRY.04a","M-PSRY.04b","M-107.04","M-103.01","CX05.01","Christmas","Christmas","Christmas","M-107.06","M-107.06","Stand Down","M-103.01","CX20.01","M-122.02b","CX05.01","M-123.01","CX05.01","M-123.01","March Break","C-122.01b","C-122.01c","C-122.01f","C-122.01i","M-122.05a","C-103.01","C-103.01","M108.03","M108.07","M108.10","M108.12"]
["Red Star",1,"PO.EO:","Admin","M-224.01a","CX05.01","C-224.02a","M-221.01","M-221.03a","M-221.05a","M-221.09a","M-208.01a","C-108.01a","C-207.01","M-203.01","CX05.01","Christmas","Christmas","Christmas","C-206.02a","C-206.02a","Stand Down","M-203.01","MX20.01D","MX20.01G","CX05.01","M-203.01","CX05.01","M-203.01","March Break","CO Parade","M222.01","M222.04","M223.01","M224.01","M224.04","M224.04","C208.01","C208.01","C208.01","C208.01"]
[null,2,"PO.EO:","Admin","M-224.01b","CX05.01","C-224.02b","M-221.02a","M-221.03b","M-221.05b","M-221.09b","M-208.01b","C-108.01b","M-207.03","M-203.02","CX05.01","Christmas","Christmas","Christmas","C-206.02b","C-206.02b","Stand Down","M-203.02","MX20.01E","MX01.01A","CX05.01","M-203.02","CX05.01","M-203.02","March Break","M222.01","M222.02","M222.05","M223.02","M224.02","M224.05","M224.05","C208.01","C208.01","C208.01","C208.01"]
[null,3,"PO.EO:","Admin","M-224.02","CX05.01","M-224.03","M-221.02b","M-221.04","M-221.05c","C-121.02","M-208.02","C-203.06b","C-206.01","CX20.01","CX05.01","Christmas","Christmas","Christmas","C-206.03","C-206.03","Stand Down","CX20.01","MX20.01F","MX01.01B","CX05.01","M-203.03","CX05.01","M-203.03","March Break","M222.02","M222.03","M222.06","M223.03","M224.03","M224.06","M224.06","C208.01","C208.01","C208.01","C208.01"]
["Silver Star",1,"PO.EO:","Admin","MX01.01A","CX05.01","M303.01","M309.01","M309.04","M309.07","M308.01","M308.02","C208.01","C208.02","M309.07","CX05.01","Christmas","Christmas","Christmas","M309.07","M309.07","Stand Down","M309.07","C203.06","C309.05","CX05.01","Optional IT","CX05.01","Optional IT","March Break","CO Parade","M322.01","M322.04","C322.01","M325.02","M326.02","M326.02","M324.01","M308.01","M308.01","M308.01"]
[null,2,"PO.EO:","Admin","MX01.01B","CX05.01","M303.02","M326.01","M324.01","M303.04","M309.06","C308.01","C208.02","M303.06","M303.06","CX05.01","Christmas","Christmas","Christmas","M303.06","M303.06","Stand Down","M303.06","MX20.01A","C309.06","CX05.01","Optional IT","CX05.01","Optional IT","March Break","M322.01","M322.02","M322.05","C322.02","M325.03","M326.03","M326.03","M324.02","M308.01","M308.01","M308.01"]
[null,3,"PO.EO:","Admin","MX01.01C","CX05.01","M303.03","M326.02","M324.02","M303.05","M309.07","C308.02","C309.06","M303.07","M303.07","CX05.01","Christmas","Christmas","Christmas","M303.07","M303.07","Stand Down","M303.07","MX20.01B","C325.01","CX05.01","M306.01","CX05.01","M306.01","March Break","M322.02","M322.03","M322.06","M325.01","M326.01","M326.04","M326.04","M324.03","M308.01","M308.01","M308.01"]
["Gold Star",1,"PO.EO:","Admin","M425.01","CX05.01","C425.01","C424.01","C424.03","M424.01","M408.01","M408.03","C408.01","M409.01","M407.01","CX05.01","Christmas","Christmas","Christmas","408 PC","408 PC","Stand Down","M407.01","M409.02","M409.05","CX05.01","C422.01","CX05.01","C422.01","March Break","CO Parade","M422.01","C422.01","M425.01","C424.01","C324.01","C324.01","M408.01","M408.04","M408.01","M408.01"]
[null,2,"PO.EO:","Admin","M425.02","CX05.01","C425.02","C424.02","C424.04","M424.02","M408.02","M408.04","C408.02","M409.02","MX20.01B","CX05.01","Christmas","Christmas","Christmas","MX20.01A","MX20.01A","Stand Down","MX20.01B","M409.03","C403.01","CX05.01","C422.02","CX05.01","C422.02","March Break","M422.01","M422.02","C422.02","M425.02","C424.02","C324.02","C324.02","M408.02","C408.01","M408.01","M408.01"]
[null,3,"PO.EO:","Admin","C424.02","CX05.01","M425.03",400,400,400,400,400,400,"C403.01","MX20.01C","CX05.01","Christmas","Christmas","Christmas","M403.01","M403.01","Stand Down","MX20.01C","M409.04","M407.03","CX05.01","C422.03","CX05.01","C422.03","March Break","M422.02","M422.03","C422.03","M409.05","C424.03","C324.03","C324.03","M408.03","C408.02","M408.01","M408.01"]
["Master Cadet",1,"PO.EO:","Admin","C507.01","M504.01","C525.01","M503.01","M503.03","M503.04",{"$nulls":4},"503 PC","M504.01","Christmas","Christmas","Christmas",null,"503 PC","Stand Down","503 PC","C509.01","502 PC","M504.01",null,"M504.01",null,"March Break","CO Parade",{"$nulls":4},"C522.01","C522.01","O-Drill","O-Drill","O-Drill","O-Drill"]
[null,2,"PO.EO:","Admin","C507.01","M504.01","C525.02","M503.02","C521.01",{"$nulls":5},"503 PC","M504.01","Christmas","Christmas","Christmas",null,"503 PC","Stand Down","503 PC","C509.01",null,"M504.01",null,"M504.01",null,"March Break",{"$nulls":5},"C522.01","C522.01","O-Drill","O-Drill","O-Drill","O-Drill"]
[null,3,"PO.EO:","Admin","C507.01","M504.01","C525.03",null,"C522.01",{"$nulls":5},"503 PC","M504.01","Christmas","Christmas","Christmas",null,"503 PC","Stand Down","503 PC","509 PC",null,"M504.01",null,"M504.01",null,"March Break",{"$nulls":5},"C522.03","C522.03","O-Drill","O-Drill","O-Drill","O-Drill"]
[]
["DRESS",null,"CAF Mbrs:","CadPat","CadPat","Sports","3C","CadPat","CadPat","CadPat","CadPat","3C","CadPat","CadPat","3C","Sports",{"$nulls":3},"CadPat","CadPat","CadPat",null,"CadPat","3C","Sports","CadPat","Sports","3C",null,"1A","CadPat","CadPat","CadPat","3C","CadPat","CadPat","CadPat","3C","3C","3C"]
[null,null,"Cadets:","FTU","FTU","Sports","C-2","FTU","FTU","FTU","FTU","C-2","FTU","FTU","C-2","Sports",{"$nulls":3},"FTU","FTU","FTU",null,"FTU","C-2","Sports","FTU","Sports","C-2",null,"C-1","FTU","FTU","FTU","C-2","FTU","FTU","FTU","C-3","C-3","C-3"]

{"sheet":"PO - Instr - Rm List","index":2,"n_rows":160,"n_cols":29,"rows_kept":160}
["NOTE:",null,"Additional classes or activities may be added, but each table must be sorted smallest to largest by the \"PO/EO No.\" column for the look-up function to polpulate the In-Year Training Plan (Under 'Review', Unprotect Sheet, the password is 'Password').",{"$nulls":14},"The PO Root column has been provided as a means to sort POs together for assigning instructors, training locations, etc."]
["Green Star",{"$nulls":5},"Red Star",{"$nulls":5},"Silver Star",{"$nulls":5},"Gold Star",{"$nulls":5},"Master Cadet"]
["PO/EO No.","PO Root","PO Title","Green Star Instructor","Green Star Location",null,"PO/EO No.","PO Root","PO Title","Red Star Instructor","Red Star Location",null,"PO/EO No.","PO Root","PO Title","Silver Star Instructor","Silver Star Location",null,"PO/EO No.","PO Root","PO Title","Gold Star Instructor","Gold Star Location",null,"PO/EO No.","PO Root","PO Title","Master Cadet Instructor","Master Cadet Location"]
[100,"00","PSRY Training",{"$nulls":3},"ACR",null,"Annual Review",{"$nulls":3},"303 PC","03","Leadership PC",{"$nulls":3},400,"00","PSRY Training",{"$nulls":3},"502 PC","02","Citizenship PC"]
["ACR",null,"Annual Review",{"$nulls":3},"C106.01","06","Marksmanship",{"$nulls":3},"308 PC","08","Drill PC",{"$nulls":3},"403 PC","03","Leadership PC",{"$nulls":3},"502 PC","02","Community Svc PC"]
["C103.01","03","Leadership",{"$nulls":3},"C107.03","07","GCK",{"$nulls":3},"309 PC","09","IT PC",{"$nulls":3},"408 PC","08","Drill PC",{"$nulls":3},"503 PC","03","Leadership PC"]
["C103.02","03","Leadership",{"$nulls":3},"C108.01","08","Drill",{"$nulls":3},"322 EC-1","22","Navigation EC",{"$nulls":3},"409 PC","09","IT PC",{"$nulls":3},"504 PC","04","Fitness & Health PC"]
["C103.03","03","Leadership",{"$nulls":3},"C121.02","21","Field Training",{"$nulls":3},"322 PC","22","Navigation PC",{"$nulls":3},"422 PC","22","Navigation PC",{"$nulls":3},"509 PC","09","IT PC"]
["C106.01","06","Marksmanship",{"$nulls":3},"C121.03","21","Field Training",{"$nulls":3},"322 PC","22","Navigation PC",{"$nulls":3},"424 PC","24","Wilderness Survival PC",{"$nulls":3},"514 PC","14","PD PC"]
["C106.02","06","Marksmanship",{"$nulls":3},"C121.04","21","Field Training",{"$nulls":3},"324 EC-1","24","Wilderness Survival EC",{"$nulls":3},"426 PC","26","Expedition PC",{"$nulls":3},"ACR",null,"Annual Review"]
["C107.01","07","GCK",{"$nulls":3},"C121.05","21","Field Training",{"$nulls":3},"324 EC-2","24","Wilderness Survival EC",{"$nulls":3},"ACR",null,"Annual Review",{"$nulls":3},"C501.01","01","Citizenship"]
["C107.02","07","GCK",{"$nulls":3},"C123.01","23","Trekking",{"$nulls":3},"324 EC-3","24","Wilderness Survival EC",{"$nulls":3},"C106.01","06","Marksmanship",{"$nulls":3},"C501.02","01","Citizenship"]
["C107.03","07","GCK",{"$nulls":3},"C123.02","23","Trekking",{"$nulls":3},"324 EC-4","24","Wilderness Survival EC",{"$nulls":3},"C111.01","11","Biathlon",{"$nulls":3},"C501.03","01","Citizenship"]
["C107.04","07","GCK",{"$nulls":3},"C123.03","23","Trekking",{"$nulls":3},"326 PC","26","Expedition PC",{"$nulls":3},"C111.02","11","Biathlon",{"$nulls":3},"C503.01","03","Leadership"]
["C108.01","08","Drill",{"$nulls":3},"C203.01","03","Leadership",{"$nulls":3},"ACR",null,"Annual Review",{"$nulls":3},"C111.03","11","Biathlon",{"$nulls":3},"C504.01","04","Fitness & Health"]
["C108.02","08","Drill",{"$nulls":3},"C203.02","03","Leadership",{"$nulls":3},"C103.03","03","Leadership",{"$nulls":3},"C111.04","11","Biathlon",{"$nulls":3},"C507.01","07","GCK"]
["C111.01","11","Biathlon",{"$nulls":3},"C203.03","03","Leadership",{"$nulls":3},"C106.01","06","Marksmanship",{"$nulls":3},"C121.02","21","Field Training",{"$nulls":3},"C507.02","07","GCK"]
["C111.02","11","Biathlon",{"$nulls":3},"C203.04","03","Leadership",{"$nulls":3},"C111.01","11","Biathlon",{"$nulls":3},"C121.03","21","Field Training",{"$nulls":3},"C507.03","07","GCK"]
["C111.03","11","Biathlon",{"$nulls":3},"C203.05","03","Leadership",{"$nulls":3},"C111.02","11","Biathlon",{"$nulls":3},"C121.04","21","Field Training",{"$nulls":3},"C509.01","09","IT"]
["C111.04","11","Biathlon",{"$nulls":3},"C203.06","03","Leadership",{"$nulls":3},"C111.03","11","Biathlon",{"$nulls":3},"C121.05","21","Field Training",{"$nulls":3},"C521.01","21","Field Training"]
["C121.01","21","Field Training",{"$nulls":3},"C206.01","06","Marksmanship",{"$nulls":3},"C111.04","11","Biathlon",{"$nulls":3},"C123.01","23","Trekking",{"$nulls":3},"C522.01","22","Navigation"]
["C121.02","21","Field Training",{"$nulls":3},"C206.02","06","Marksmanship",{"$nulls":3},"C121.02","21","Field Training",{"$nulls":3},"C123.02","23","Trekking",{"$nulls":3},"C525.01","25","Outdoor Leadership"]
["C121.03","21","Field Training",{"$nulls":3},"C206.03","06","Marksmanship",{"$nulls":3},"C121.03","21","Field Training",{"$nulls":3},"C123.03","23","Trekking",{"$nulls":3},"C525.02","25","Outdoor Leadership"]
["C121.04","21","Field Training",{"$nulls":3},"C207.01","07","GCK",{"$nulls":3},"C121.04","21","Field Training",{"$nulls":3},"C208.01","08","Drill",{"$nulls":3},"C525.03","25","Outdoor Leadership"]
["C121.05","21","Field Training",{"$nulls":3},"C207.02","07","GCK",{"$nulls":3},"C121.05","21","Field Training",{"$nulls":3},"C208.02","08","Drill",{"$nulls":3},"C527.01","27","CF & Outdoor"]
["C122.01","22","Navigation","2Lt Chen","Green Star Room (A)",null,"C208.01","08","Drill",{"$nulls":3},"C123.01","23","Trekking",{"$nulls":3},"C211.01","11","Biathlon",{"$nulls":3},"Christmas",null,"No Training"]
["C123.01","23","Trekking",{"$nulls":3},"C208.02","08","Drill",{"$nulls":3},"C123.02","23","Trekking",{"$nulls":3},"C211.02","11","Biathlon",{"$nulls":3},"CO",null,"CO's Parade","CO","Parking Lot"]
["C123.02","23","Trekking",{"$nulls":3},"C211.01","11","Biathlon",{"$nulls":3},"C123.03","23","Trekking",{"$nulls":3},"C211.03","11","Biathlon",{"$nulls":3},"Easter",null,"No Training"]
["C123.03","23","Trekking",{"$nulls":3},"C211.02","11","Biathlon",{"$nulls":3},"C203.02","03","Leadership",{"$nulls":3},"C211.04","11","Biathlon",{"$nulls":3},"M502.01","02","Community Svc"]
["Christmas",null,"No Training",{"$nulls":3},"C211.03","11","Biathlon",{"$nulls":3},"C203.04","03","Leadership",{"$nulls":3},"C303.01","03","Leadership",{"$nulls":3},"M503.01","03","Leadership"]
["CO",null,"CO's Parade","CO","Parking Lot",null,"C211.04","11","Biathlon",{"$nulls":3},"C203.05","03","Leadership",{"$nulls":3},"C303.02","03","Leadership",{"$nulls":3},"M503.02","03","Leadership"]
["CX01.01","01","Citizenship",{"$nulls":3},"C221.01","21","Field Training",{"$nulls":3},"C203.06","03","Leadership",{"$nulls":3},"C306.01","06","Marksmanship",{"$nulls":3},"M503.03","03","Leadership"]
["CX02.01","02","Community Svc",{"$nulls":3},"C221.02","21","Field Training",{"$nulls":3},"C206.01","06","Marksmanship",{"$nulls":3},"C306.02","06","Marksmanship",{"$nulls":3},"M503.04","03","Leadership"]
["CX04.01","04","Fitness & Health",{"$nulls":3},"C221.03","21","Field Training",{"$nulls":3},"C206.02","06","Marksmanship",{"$nulls":3},"C306.03","06","Marksmanship",{"$nulls":3},"M504.01","04","Fitness & Health"]
["CX04.02","04","Fitness & Health",{"$nulls":3},"C222.01","22","Navigation",{"$nulls":3},"C206.03","06","Marksmanship",{"$nulls":3},"C307.01","07","GCK",{"$nulls":3},"M507.01","07","GCK"]
["CX04.03","04","Fitness & Health",{"$nulls":3},"C224.01","24","Wilderness Survival",{"$nulls":3},"C208.01","08","Drill",{"$nulls":3},"C307.02","07","GCK",{"$nulls":3},"March Break",null,"No Training"]
["CX04.04","04","Fitness & Health",{"$nulls":3},"C224.02","24","Wilderness Survival",{"$nulls":3},"C208.02","08","Drill",{"$nulls":3},"C307.03","07","GCK",{"$nulls":3},"OJT"]
["CX04.05","04","Fitness & Health",{"$nulls":3},"Christmas",null,"No Training",{"$nulls":3},"C211.01","11","Biathlon",{"$nulls":3},"C308.01","08","Drill",{"$nulls":3},"Optional"]
["CX05.01","05","Physical Activities",{"$nulls":3},"CO",null,"CO's Parade","CO","Parking Lot",null,"C211.02","11","Biathlon",{"$nulls":3},"C308.02","08","Drill",{"$nulls":3},"SD",null,"Self-Directed Activity"]
["CX05.02","05","Physical Activities",{"$nulls":3},"CX01.01","01","Citizenship",{"$nulls":3},"C211.03","11","Biathlon",{"$nulls":3},"C309.04","09","IT",{"$nulls":3},"Sports",null,"Sports"]
["CX20.01","20","CAF Famil",{"$nulls":3},"CX02.01","02","Community Svc",{"$nulls":3},"C211.04","11","Biathlon",{"$nulls":3},"C309.06","09","IT",{"$nulls":3},"Thanksgiving",null,"No Training"]
["Easter",null,"No Training",{"$nulls":3},"CX04.01","04","Fitness & Health",{"$nulls":3},"C224.01","24","Wilderness Survival",{"$nulls":3},"C311.01","11","Biathlon",{"$nulls":3},"Victoria Day",null,"No Training"]
["M103.01","03","Leadership",{"$nulls":3},"CX04.02","04","Fitness & Health",{"$nulls":3},"C224.02","24","Wilderness Survival",{"$nulls":3},"C311.02","11","Biathlon",{"$nulls":3},"Admin",null,"Admin"]
["M103.02","03","Leadership",{"$nulls":3},"CX04.03","04","Fitness & Health",{"$nulls":3},"C303.01","03","Leadership",{"$nulls":3},"C322.02","22","Navigation"]
["M103.06","03","Leadership",{"$nulls":3},"CX04.04","04","Fitness & Health",{"$nulls":3},"C303.02","03","Leadership",{"$nulls":3},"C324.01","24","Wilderness Survival"]
["M106.01","06","Marksmanship",{"$nulls":3},"CX04.05","04","Fitness & Health",{"$nulls":3},"C306.01","06","Marksmanship",{"$nulls":3},"C324.02","24","Wilderness Survival"]
["M106.02","06","Marksmanship",{"$nulls":3},"CX05.01","05","Physical Activities",{"$nulls":3},"C306.02","06","Marksmanship",{"$nulls":3},"C324.03","24","Wilderness Survival"]
["M106.03","06","Marksmanship",{"$nulls":3},"CX05.02","05","Physical Activities",{"$nulls":3},"C306.03","06","Marksmanship",{"$nulls":3},"C324.04","24","Wilderness Survival"]
["M106.04","06","Marksmanship",{"$nulls":3},"CX20.01","20","CAF Famil",{"$nulls":3},"C307.01","07","GCK",{"$nulls":3},"C324.05","24","Wilderness Survival"]
["M106.05","06","Marksmanship",{"$nulls":3},"Easter",null,"No Training",{"$nulls":3},"C307.02","07","GCK",{"$nulls":3},"C325.01","25","Outdoor Leadership"]
["M107.01","07","GCK",{"$nulls":3},"M203.01","03","Leadership",{"$nulls":3},"C307.03","07","GCK",{"$nulls":3},"C325.02","25","Outdoor Leadership"]
["M107.02","07","GCK",{"$nulls":3},"M203.02","03","Leadership",{"$nulls":3},"C308.01","08","Drill",{"$nulls":3},"C403.01","03","Leadership"]
["M107.03","07","GCK",{"$nulls":3},"M203.03","03","Leadership",{"$nulls":3},"C308.02","08","Drill",{"$nulls":3},"C406.01","06","Marksmanship"]
["M107.04","07","GCK",{"$nulls":3},"M203.04","03","Leadership",{"$nulls":3},"C309.01","09","IT",{"$nulls":3},"C406.02","06","Marksmanship"]
["M107.05","07","GCK",{"$nulls":3},"M203.05","03","Leadership",{"$nulls":3},"C309.02","09","IT",{"$nulls":3},"C407.01","07","GCK"]
["M107.06","07","GCK",{"$nulls":3},"M203.06","03","Leadership",{"$nulls":3},"C309.03","09","IT",{"$nulls":3},"C408.01","08","Drill"]
["M108.01","08","Drill",{"$nulls":3},"M203.07","03","Leadership",{"$nulls":3},"C309.04","09","IT",{"$nulls":3},"C408.02","08","Drill"]
["M108.02","08","Drill",{"$nulls":3},"M203.08","03","Leadership",{"$nulls":3},"C309.05","09","IT",{"$nulls":3},"C409.01","09","IT"]
["M108.03","08","Drill",{"$nulls":3},"M206.01","06","Marksmanship",{"$nulls":3},"C309.06","09","IT",{"$nulls":3},"C409.02","09","IT"]
["M108.04","08","Drill",{"$nulls":3},"M207.01","07","GCK",{"$nulls":3},"C311.01","11","Biathlon",{"$nulls":3},"C409.03","09","IT"]
["M108.05","08","Drill",{"$nulls":3},"M207.02","07","GCK",{"$nulls":3},"C311.02","11","Biathlon",{"$nulls":3},"C409.04","09","IT"]
["M108.07","08","Drill",{"$nulls":3},"M207.03","07","GCK",{"$nulls":3},"C321.01","21","Field Training",{"$nulls":3},"C409.05","09","IT"]
["M108.08","08","Drill",{"$nulls":3},"M207.04","07","GCK",{"$nulls":3},"C321.02","21","Field Training",{"$nulls":3},"C409.05","09","IT"]
["M108.09","08","Drill",{"$nulls":3},"M208.01","08","Drill",{"$nulls":3},"C321.03","21","Field Training",{"$nulls":3},"C409.06","09","IT"]
["M108.10","08","Drill",{"$nulls":3},"M208.02","08","Drill",{"$nulls":3},"C322.01","22","Navigation",{"$nulls":3},"C422.01","22","Navigation"]
["M108.11","08","Drill",{"$nulls":3},"M221.01","21","Field Training",{"$nulls":3},"C322.02","22","Navigation",{"$nulls":3},"C422.02","22","Navigation"]
["M108.12","08","Drill",{"$nulls":3},"M221.02","21","Field Training",{"$nulls":3},"C322.03","22","Navigation",{"$nulls":3},"C422.03","22","Navigation"]
["M121.01","21","Field Training",{"$nulls":3},"M221.03","21","Field Training",{"$nulls":3},"C322.04","22","Navigation",{"$nulls":3},"C422.04","22","Navigation"]
["M121.02","21","Field Training",{"$nulls":3},"M221.04","21","Field Training",{"$nulls":3},"C324.01","24","Wilderness Survival",{"$nulls":3},"C422.05","22","Navigation"]
["M121.03","21","Field Training",{"$nulls":3},"M221.05","21","Field Training",{"$nulls":3},"C324.02","24","Wilderness Survival",{"$nulls":3},"C422.06","22","Navigation"]
["M121.04","21","Field Training",{"$nulls":3},"M221.06","21","Field Training",{"$nulls":3},"C324.03","24","Wilderness Survival",{"$nulls":3},"C424.01","24","Wilderness Survival"]
["M121.05","21","Field Training",{"$nulls":3},"M221.07","21","Field Training",{"$nulls":3},"C324.04","24","Wilderness Survival",{"$nulls":3},"C424.02","24","Wilderness Survival"]
["M121.06","21","Field Training",{"$nulls":3},"M221.08","21","Field Training",{"$nulls":3},"C324.05","24","Wilderness Survival",{"$nulls":3},"C424.03","24","Wilderness Survival"]
["M121.07","21","Field Training",{"$nulls":3},"M221.09","21","Field Training",{"$nulls":3},"C324.06","24","Wilderness Survival",{"$nulls":3},"C424.04","24","Wilderness Survival"]
["M121.08","21","Field Training",{"$nulls":3},"M222.01","22","Navigation","WO Ma","Back Classroom",null,"C325.01","25","Outdoor Leadership",{"$nulls":3},"C425.01","25","Outdoor Leadership"]
["M121.09","21","Field Training",{"$nulls":3},"M222.02","22","Navigation","WO Ma","Back Classroom",null,"C325.02","25","Outdoor Leadership",{"$nulls":3},"C425.02","25","Outdoor Leadership"]
["M122.01","22","Navigation","2Lt Chen","Green Star Room (A)",null,"M222.03","22","Navigation",{"$nulls":3},"Christmas",null,"No Training",{"$nulls":3},"Christmas",null,"No Training"]
["M122.02","22","Navigation",{"$nulls":3},"M222.04","22","Navigation",{"$nulls":3},"CO",null,"CO's Parade","CO","Parking Lot",null,"CO",null,"CO's Parade","CO","Parking Lot"]
["M122.03","22","Navigation",{"$nulls":3},"M222.05","22","Navigation",{"$nulls":3},"CX01.01","01","Citizenship",{"$nulls":3},"CX01.01","01","Citizenship"]
["M122.04","22","Navigation",{"$nulls":3},"M222.06","22","Navigation",{"$nulls":3},"CX02.01","02","Community Svc",{"$nulls":3},"CX02.01","02","Community Svc"]
["M122.05","22","Navigation",{"$nulls":3},"M223.01","23","Trekking",{"$nulls":3},"CX04.01","04","Fitness & Health",{"$nulls":3},"CX04.01","04","Fitness & Health"]
["M122.06","22","Navigation",{"$nulls":3},"M223.02","23","Trekking",{"$nulls":3},"CX04.02","04","Fitness & Health",{"$nulls":3},"CX04.02","04","Fitness & Health"]
["M123.01","23","Trekking",{"$nulls":3},"M223.03","23","Trekking",{"$nulls":3},"CX04.03","04","Fitness & Health",{"$nulls":3},"CX04.03","04","Fitness & Health"]
["M123.02","23","Trekking",{"$nulls":3},"M224.01","24","Wilderness Survival",{"$nulls":3},"CX04.04","04","Fitness & Health",{"$nulls":3},"CX04.04","04","Fitness & Health"]
["March Break",null,"No Training",{"$nulls":3},"M224.02","24","Wilderness Survival",{"$nulls":3},"CX04.05","04","Fitness & Health",{"$nulls":3},"CX04.05","04","Fitness & Health"]
["MX01.01A","01","Citizenship",{"$nulls":3},"M224.03","24","Wilderness Survival",{"$nulls":3},"CX05.01","05","Physical Activities",{"$nulls":3},"CX05.01","05","Physical Activities"]
["MX01.01B","01","Citizenship",{"$nulls":3},"M224.04","24","Wilderness Survival",{"$nulls":3},"CX05.02","05","Physical Activities",{"$nulls":3},"CX05.02","05","Physical Activities"]
["MX01.01C","01","Citizenship",{"$nulls":3},"M224.05","24","Wilderness Survival",{"$nulls":3},"CX20.01","20","CAF Famil",{"$nulls":3},"CX20.01","20","CAF Famil"]
["MX01.01D","01","Citizenship",{"$nulls":3},"M224.06","24","Wilderness Survival",{"$nulls":3},"Easter",null,"No Training",{"$nulls":3},"Easter",null,"No Training"]
["MX01.01E","01","Citizenship",{"$nulls":3},"March Break",null,"No Training",{"$nulls":3},"M303.01","03","Leadership",{"$nulls":3},"M403.01","03","Leadership"]
["MX01.01F","01","Citizenship",{"$nulls":3},"MX01.01A","01","Citizenship",{"$nulls":3},"M303.02","03","Leadership",{"$nulls":3},"M403.02","03","Leadership"]
["MX01.01G","01","Citizenship",{"$nulls":3},"MX01.01B","01","Citizenship",{"$nulls":3},"M303.03","03","Leadership",{"$nulls":3},"M403.03","03","Leadership"]
["MX01.01H","01","Citizenship",{"$nulls":3},"MX01.01C","01","Citizenship",{"$nulls":3},"M303.04","03","Leadership",{"$nulls":3},"M403.04","03","Leadership"]
["MX02.01","02","Community Svc",{"$nulls":3},"MX01.01D","01","Citizenship",{"$nulls":3},"M303.05","03","Leadership",{"$nulls":3},"M403.05","03","Leadership"]
["MX04.01","04","Fitness & Health",{"$nulls":3},"MX01.01E","01","Citizenship",{"$nulls":3},"M303.06","03","Leadership",{"$nulls":3},"M403.06","03","Leadership"]
["MX04.02","04","Fitness & Health",{"$nulls":3},"MX01.01F","01","Citizenship",{"$nulls":3},"M303.07","03","Leadership",{"$nulls":3},"M406.01","06","Marksmanship"]
["MX04.03","04","Fitness & Health",{"$nulls":3},"MX01.01G","01","Citizenship",{"$nulls":3},"M306.01","06","Marksmanship",{"$nulls":3},"M407.01","07","GCK"]
["MX05.01","05","Physical Activities",{"$nulls":3},"MX01.01H","01","Citizenship",{"$nulls":3},"M307.01","07","GCK",{"$nulls":3},"M407.02","07","GCK"]
["MX20.01A","20","CAF Famil",{"$nulls":3},"MX02.01","02","Community Svc",{"$nulls":3},"M307.02","07","GCK",{"$nulls":3},"M407.03","07","GCK"]
["MX20.01B","20","CAF Famil",{"$nulls":3},"MX04.01","04","Fitness & Health",{"$nulls":3},"M307.03","07","GCK",{"$nulls":3},"M408.01","08","Drill"]
["MX20.01C","20","CAF Famil",{"$nulls":3},"MX04.02","04","Fitness & Health",{"$nulls":3},"M308.01","08","Drill",{"$nulls":3},"M408.02","08","Drill"]
["MX20.01D","20","CAF Famil",{"$nulls":3},"MX04.03","04","Fitness & Health",{"$nulls":3},"M308.02","08","Drill",{"$nulls":3},"M408.03","08","Drill"]
["MX20.01E","20","CAF Famil",{"$nulls":3},"MX05.01","05","Physical Activities",{"$nulls":3},"M309.01","09","IT",{"$nulls":3},"M408.04","08","Drill"]
["MX20.01F","20","CAF Famil",{"$nulls":3},"MX20.01A","20","CAF Famil",{"$nulls":3},"M309.02","09","IT",{"$nulls":3},"M409.01","09","IT"]
["MX20.01G","20","CAF Famil",{"$nulls":3},"MX20.01B","20","CAF Famil",{"$nulls":3},"M309.03","09","IT",{"$nulls":3},"M409.02","09","IT"]
["MX20.01H","20","CAF Famil",{"$nulls":3},"MX20.01C","20","CAF Famil",{"$nulls":3},"M309.04","09","IT",{"$nulls":3},"M409.03","09","IT"]
["Optional",{"$nulls":5},"MX20.01D","20","CAF Famil",{"$nulls":3},"M309.05","09","IT",{"$nulls":3},"M409.04","09","IT"]
["Pl Comd",null,"Pl Comd Period",{"$nulls":3},"MX20.01E","20","CAF Famil",{"$nulls":3},"M309.06","09","IT",{"$nulls":3},"M409.05","09","IT"]
["Recruiting",{"$nulls":5},"MX20.01F","20","CAF Famil",{"$nulls":3},"M309.07","09","IT",{"$nulls":3},"M422.01","22","Navigation","Lt Heaton","Upstairs Classroom"]
["Sports",{"$nulls":5},"MX20.01G","20","CAF Famil",{"$nulls":3},"M321.01","21","Field Training",{"$nulls":3},"M422.02","22","Navigation","Lt Heaton","Upstairs Classroom"]
["Thanksgiving",null,"No Training",{"$nulls":3},"MX20.01H","20","CAF Famil",{"$nulls":3},"M321.02","21","Field Training",{"$nulls":3},"M422.03","22","Navigation"]
["Victoria Day",null,"No Training",{"$nulls":3},"Optional",{"$nulls":5},"M322.01","22","Navigation","WO Mallon","Green Star Rm (B)",null,"M424.01","24","Wilderness Survival"]
["Admin",null,"Admin",{"$nulls":3},"Pl Comd",null,"Pl Comd Period",{"$nulls":3},"M322.02","22","Navigation","WO Mallon","Green Star Rm (B)",null,"M424.02","24","Wilderness Survival"]
[{"$nulls":6},"Sports",null,"Sports",{"$nulls":3},"M322.03","22","Navigation",{"$nulls":3},"M424.03","24","Wilderness Survival"]
[{"$nulls":6},"Thanksgiving",null,"No Training",{"$nulls":3},"M322.04","22","Navigation",{"$nulls":3},"M425.01","25","Outdoor Leadership"]
[{"$nulls":6},"Victoria Day",null,"No Training",{"$nulls":3},"M322.05","22","Navigation",{"$nulls":3},"M425.02","25","Outdoor Leadership"]
[{"$nulls":6},"Admin",null,"Admin",{"$nulls":3},"M322.06","22","Navigation",{"$nulls":3},"M425.03","25","Outdoor Leadership"]
[{"$nulls":12},"M324.01","24","Wilderness Survival",{"$nulls":3},"M425.04","25","Outdoor Leadership"]
[{"$nulls":12},"M324.02","24","Wilderness Survival",{"$nulls":3},"M426.01","26","Expedition"]
[{"$nulls":12},"M324.03","24","Wilderness Survival",{"$nulls":3},"M426.02A","26","Expedition"]
[{"$nulls":12},"M324.04","24","Wilderness Survival",{"$nulls":3},"M426.02B","26","Expedition"]
[{"$nulls":12},"M324.05","24","Wilderness Survival",{"$nulls":3},"M426.02C","26","Expedition"]
[{"$nulls":12},"M325.01","25","Outdoor Leadership",{"$nulls":3},"M426.02D","26","Expedition"]
[{"$nulls":12},"M325.02","25","Outdoor Leadership",{"$nulls":3},"M426.02E","26","Expedition"]
[{"$nulls":12},"M325.03","25","Outdoor Leadership",{"$nulls":3},"March Break",null,"No Training"]
[{"$nulls":12},"M326.01","26","Expedition",{"$nulls":3},"MX01.01A","01","Citizenship"]
[{"$nulls":12},"M326.02","26","Expedition",{"$nulls":3},"MX01.01B","01","Citizenship"]
[{"$nulls":12},"M326.03","26","Expedition",{"$nulls":3},"MX01.01C","01","Citizenship"]
[{"$nulls":12},"M326.04","26","Expedition",{"$nulls":3},"MX01.01D","01","Citizenship"]
[{"$nulls":12},"M326.05","26","Expedition",{"$nulls":3},"MX01.01E","01","Citizenship"]
[{"$nulls":12},"M326.06","26","Expedition",{"$nulls":3},"MX01.01F","01","Citizenship"]
[{"$nulls":12},"M326.07","26","Expedition",{"$nulls":3},"MX01.01G","01","Citizenship"]
[{"$nulls":12},"March Break",null,"No Training",{"$nulls":3},"MX01.01H","01","Citizenship"]
[{"$nulls":12},"MX01.01A","01","Citizenship",{"$nulls":3},"MX02.01","02","Community Svc"]
[{"$nulls":12},"MX01.01B","01","Citizenship",{"$nulls":3},"MX04.01","04","Fitness & Health"]
[{"$nulls":12},"MX01.01C","01","Citizenship",{"$nulls":3},"MX04.02","04","Fitness & Health"]
[{"$nulls":12},"MX01.01D","01","Citizenship",{"$nulls":3},"MX04.03","04","Fitness & Health"]
[{"$nulls":12},"MX01.01E","01","Citizenship",{"$nulls":3},"MX05.01","05","Physical Activities"]
[{"$nulls":12},"MX01.01F","01","Citizenship",{"$nulls":3},"MX20.01A","20","CAF Famil"]
[{"$nulls":12},"MX01.01G","01","Citizenship",{"$nulls":3},"MX20.01B","20","CAF Famil"]
[{"$nulls":12},"MX01.01H","01","Citizenship",{"$nulls":3},"MX20.01C","20","CAF Famil"]
[{"$nulls":12},"MX02.01","02","Community Svc",{"$nulls":3},"MX20.01D","20","CAF Famil"]
[{"$nulls":12},"MX04.01","04","Fitness & Health",{"$nulls":3},"MX20.01E","20","CAF Famil"]
[{"$nulls":12},"MX04.02","04","Fitness & Health",{"$nulls":3},"MX20.01F","20","CAF Famil"]
[{"$nulls":12},"MX04.03","04","Fitness & Health",{"$nulls":3},"MX20.01G","20","CAF Famil"]
[{"$nulls":12},"MX05.01","05","Physical Activities",{"$nulls":3},"MX20.01H","20","CAF Famil"]
[{"$nulls":12},"MX20.01A","20","CAF Famil",{"$nulls":3},"Optional"]
[{"$nulls":12},"MX20.01B","20","CAF Famil",{"$nulls":3},"Pl Comd",null,"Pl Comd Period"]
[{"$nulls":12},"MX20.01C","20","CAF Famil",{"$nulls":3},"Sports",null,"Sports"]
[{"$nulls":12},"MX20.01D","20","CAF Famil",{"$nulls":3},"Thanksgiving",null,"No Training"]
[{"$nulls":12},"MX20.01E","20","CAF Famil",{"$nulls":3},"Victoria Day",null,"No Training"]
[{"$nulls":12},"MX20.01F","20","CAF Famil",{"$nulls":3},"Admin",null,"Admin"]
[{"$nulls":12},"MX20.01G","20","CAF Famil"]
[{"$nulls":12},"MX20.01H","20","CAF Famil"]
[{"$nulls":12},"Optional"]
[{"$nulls":12},"Pl Comd",null,"Pl Comd Period"]
[{"$nulls":12},"Sports",null,"Sports"]
[{"$nulls":12},"Thanksgiving",null,"No Training"]
[{"$nulls":12},"Victoria Day",null,"No Training"]
[{"$nulls":12},"Admin",null,"Admin"]

{"sheet":"In-year Trg Plan","index":3,"n_rows":133,"n_cols":48,"rows_kept":133,"merged":[[4,0,15,0],[4,1,7,1],[8,1,11,1],[12,1,15,1],[16,0,27,0],[16,1,19,1],[20,1,23,1],[24,1,27,1],[28,0,39,0],[28,1,31,1],[32,1,35,1],[36,1,39,1],[40,0,51,0],[40,1,43,1],[44,1,47,1],[48,1,51,1],[52,0,63,0],[52,1,55,1],[56,1,59,1],[60,1,63,1],[68,4,68,5]]}
[]
[]
[null,null,"RO No.",{"$f":"IF(AND(MONTH(D4)=1,_xlfn.ISOWEEKNUM(D4)=52),CONCATENATE(TEXT(D4-365,\"yy\"),\"-\",TEXT(_xlfn.ISOWEEKNUM(D4),\"00#\")),CONCATENATE(TEXT(D4,\"yy\"),\"-\",TEXT(_xlfn.ISOWEEKNUM(D4),\"00#\")))","v":"19-037"},{"$f":"IF(AND(MONTH(E4)=1,_xlfn.ISOWEEKNUM(E4)=52),CONCATENATE(TEXT(E4-365,\"yy\"),\"-\",TEXT(_xlfn.ISOWEEKNUM(E4),\"00#\")),CONCATENATE(TEXT(E4,\"yy\"),\"-\",TEXT(_xlfn.ISOWEEKNUM(E4),\"00#\")))","v":"19-038"},"19-039","19-040","19-041","19-042","19-043","19-045","19-046","19-047","19-048","19-049","19-050","19-051","19-052","20-001","20-002","20-003","20-004","20-005","20-006","20-007","20-008","20-009","20-010","20-011","20-012","20-013","20-014","20-015","20-016","20-017","20-018","20-019","20-020","20-021","20-022","20-023","20-024","20-025","20-026","20-027","20-028","20-029","20-030"]
[null,null,"Date",{"$f":"IF(ISBLANK('Unit Info'!$B$14),\"\",'Unit Info'!$B$14)","v":"2019-09-12"},{"$f":"D4+7","v":"2019-09-19"},{"$f":"E4+7","v":"2019-09-26"},"2019-10-03","2019-10-10","2019-10-17","2019-10-24","2019-11-07","2019-11-14","2019-11-21","2019-11-28","2019-12-05","2019-12-12","2019-12-19","2019-12-26","2020-01-02","2020-01-09","2020-01-16","2020-01-23","2020-01-30","2020-02-06","2020-02-13","2020-02-20","2020-02-27","2020-03-05","2020-03-12","2020-03-19","2020-03-26","2020-04-02","2020-04-09","2020-04-16","2020-04-23","2020-04-30","2020-05-07","2020-05-14","2020-05-21","2020-05-28","2020-06-04","2020-06-11","2020-06-18","2020-06-25","2020-07-02","2020-07-09","2020-07-16","2020-07-23"]
["Green Star",1,"PO/EO No.",{"$f":"'Master PO Schedule'!D2","v":"Admin"},{"$f":"'Master PO Schedule'!E2","v":"M-108.01"},{"$f":"'Master PO Schedule'!F2","v":"CX05.01"},{"$f":"'Master PO Schedule'!G2","v":"M-121.01b"},{"$f":"'Master PO Schedule'!H2","v":"M-121.03a"},{"$f":"'Master PO Schedule'!I2","v":"M-121.03c"},{"$f":"'Master PO Schedule'!J2","v":"M-121.05"},{"$f":"'Master PO Schedule'!K2","v":"M-108.03"},{"$f":"'Master PO Schedule'!L2","v":"M-108.05"},{"$f":"'Master PO Schedule'!M2","v":"M-108.07"},{"$f":"'Master PO Schedule'!N2","v":"M-107.01"},{"$f":"'Master PO Schedule'!O2","v":"C-107.02"},{"$f":"'Master PO Schedule'!P2","v":"CX05.01"},{"$f":"'Master PO Schedule'!Q2","v":"Christmas"},{"$f":"'Master PO Schedule'!R2","v":"Christmas"},{"$f":"'Master PO Schedule'!S2","v":"Christmas"},{"$f":"'Master PO Schedule'!T2","v":"M-107.05a"},{"$f":"'Master PO Schedule'!U2","v":"M-107.05a"},{"$f":"'Master PO Schedule'!V2","v":"Stand Down"},{"$f":"'Master PO Schedule'!W2","v":"C-107.02"},{"$f":"'Master PO Schedule'!X2","v":"CX20.01"},{"$f":"'Master PO Schedule'!Y2","v":"M-122.01"},{"$f":"'Master PO Schedule'!Z2","v":"CX05.01"},{"$f":"'Master PO Schedule'!AA2","v":"M-122.03"},{"$f":"'Master PO Schedule'!AB2","v":"CX05.01"},{"$f":"'Master PO Schedule'!AC2","v":"M-122.03"},{"$f":"'Master PO Schedule'!AD2","v":"March Break"},{"$f":"'Master PO Schedule'!AE2","v":"CO Parade"},{"$f":"'Master PO Schedule'!AF2","v":"C-122.01a"},{"$f":"'Master PO Schedule'!AG2","v":"C-122.01d"},{"$f":"'Master PO Schedule'!AH2","v":"C-122.01g"},{"$f":"'Master PO Schedule'!AI2","v":"C-122.01j"},{"$f":"'Master PO Schedule'!AJ2","v":"M-122.05b"},{"$f":"'Master PO Schedule'!AK2","v":"M-122.05b"},{"$f":"'Master PO Schedule'!AL2","v":"M108.01"},{"$f":"'Master PO Schedule'!AM2","v":"M108.04"},{"$f":"'Master PO Schedule'!AN2","v":"M108.08"},{"$f":"'Master PO Schedule'!AO2","v":"M108.11"},{"$f":"'Master PO Schedule'!AP2","v":{"v":0,"d":"0.00"}},{"$f":"'Master PO Schedule'!AQ2","v":{"v":0,"d":"0.00"}},{"$f":"'Master PO Schedule'!AR2","v":{"v":0,"d":"0.00"}},{"$f":"'Master PO Schedule'!AS2","v":{"v":0,"d":"0.00"}},{"$f":"'Master PO Schedule'!AT2","v":{"v":0,"d":"0.00"}},{"$f":"'Master PO Schedule'!AU2","v":{"v":0,"d":"0.00"}},{"$f":"'Master PO Schedule'!AV2","v":{"v":0,"d":"0.00"}}]
[null,null,"PO Title",{"$f":"VLOOKUP(D$5,Year_One[],3)","v":"Annual Review"},{"$f":"VLOOKUP(E$5,Year_One[],3)","v":"Drill"},{"$f":"VLOOKUP(F$5,Year_One[],3)","v":"Physical Activities"},{"$f":"VLOOKUP(G$5,Year_One[],3)","v":"Field Training"},{"$f":"VLOOKUP(H$5,Year_One[],3)","v":"Field Training"},{"$f":"VLOOKUP(I$5,Year_One[],3)","v":"Field Training"},{"$f":"VLOOKUP(J$5,Year_One[],3)","v":"Field Training"},{"$f":"VLOOKUP(K$5,Year_One[],3)","v":"Drill"},{"$f":"VLOOKUP(L$5,Year_One[],3)","v":"Drill"},{"$f":"VLOOKUP(M$5,Year_One[],3)","v":"Drill"},{"$f":"VLOOKUP(N$5,Year_One[],3)","v":"GCK"},{"$f":"VLOOKUP(O$5,Year_One[],3)","v":"GCK"},{"$f":"VLOOKUP(P$5,Year_One[],3)","v":"Physical Activities"},{"$f":"VLOOKUP(Q$5,Year_One[],3)","v":"No Training"},{"$f":"VLOOKUP(R$5,Year_One[],3)","v":"No Training"},{"$f":"VLOOKUP(S$5,Year_One[],3)","v":"No Training"},{"$f":"VLOOKUP(T$5,Year_One[],3)","v":"GCK"},{"$f":"VLOOKUP(U$5,Year_One[],3)","v":"GCK"},{"$f":"VLOOKUP(V$5,Year_One[],3)","v":{"v":0,"d":"0.00"}},{"$f":"VLOOKUP(W$5,Year_One[],3)","v":"GCK"},{"$f":"VLOOKUP(X$5,Year_One[],3)","v":"CAF Famil"},{"$f":"VLOOKUP(Y$5,Year_One[],3)","v":"Navigation"},{"$f":"VLOOKUP(Z$5,Year_One[],3)","v":"Physical Activities"},{"$f":"VLOOKUP(AA$5,Year_One[],3)","v":"Navigation"},{"$f":"VLOOKUP(AB$5,Year_One[],3)","v":"Physical Activities"},{"$f":"VLOOKUP(AC$5,Year_One[],3)","v":"Navigation"},{"$f":"VLOOKUP(AD$5,Year_One[],3)","v":"No Training"},{"$f":"VLOOKUP(AE$5,Year_One[],3)","v":"CO's Parade"},{"$f":"VLOOKUP(AF$5,Year_One[],3)","v":"Navigation"},{"$f":"VLOOKUP(AG$5,Year_One[],3)","v":"Navigation"},{"$f":"VLOOKUP(AH$5,Year_One[],3)","v":"Navigation"},{"$f":"VLOOKUP(AI$5,Year_One[],3)","v":"Navigation"},{"$f":"VLOOKUP(AJ$5,Year_One[],3)","v":"Navigation"},{"$f":"VLOOKUP(AK$5,Year_One[],3)","v":"Navigation"},{"$f":"VLOOKUP(AL$5,Year_One[],3)","v":"Drill"},{"$f":"VLOOKUP(AM$5,Year_One[],3)","v":"Drill"},{"$f":"VLOOKUP(AN$5,Year_One[],3)","v":"Drill"},{"$f":"VLOOKUP(AO$5,Year_One[],3)","v":"Drill"},{"$f":"VLOOKUP(AP$5,Year_One[],3)","v":{"$error":"#N/A"}},{"$f":"VLOOKUP(AQ$5,Year_One[],3)","v":{"$error":"#N/A"}},{"$f":"VLOOKUP(AR$5,Year_One[],3)","v":{"$error":"#N/A"}},{"$f":"VLOOKUP(AS$5,Year_One[],3)","v":{"$error":"#N/A"}},{"$f":"VLOOKUP(AT$5,Year_One[],3)","v":{"$error":"#N/A"}},{"$f":"VLOOKUP(AU$5,Year_One[],3)","v":{"$error":"#N/A"}},{"$f":"VLOOKUP(AV$5,Year_One[],3)","v":{"$error":"#N/A"}}]
[null,null,"Instructor",{"$f":"VLOOKUP(D$5,Year_One[],4)","v":{"v":0,"d":"0.00"}},{"$f":"VLOOKUP(E$5,Year_One[],4)","v":{"v":0,"d":"0.00"}},{"$f":"VLOOKUP(F$5,Year_One[],4)","v":{"v":0,"d":"0.00"}},{"$f":"VLOOKUP(G$5,Year_One[],4)","v":{"v":0,"d":"0.00"}},{"$f":"VLOOKUP(H$5,Year_One[],4)","v":{"v":0,"d":"0.00"}},{"$f":"VLOOKUP(I$5,Year_One[],4)","v":{"v":0,"d":"0.00"}},{"$f":"VLOOKUP(J$5,Year_One[],4)","v":{"v":0,"d":"0.00"}},{"$f":"VLOOKUP(K$5,Year_One[],4)","v":{"v":0,"d":"0.00"}},{"$f":"VLOOKUP(L$5,Year_One[],4)","v":{"v":0,"d":"0.00"}},{"$f":"VLOOKUP(M$5,Year_One[],4)","v":{"v":0,"d":"0.00"}},{"$f":"VLOOKUP(N$5,Year_One[],4)","v":{"v":0,"d":"0.00"}},{"$f":"VLOOKUP(O$5,Year_One[],4)","v":{"v":0,"d":"0.00"}},{"$f":"VLOOKUP(P$5,Year_One[],4)","v":{"v":0,"d":"0.00"}},{"$f":"VLOOKUP(Q$5,Year_One[],4)","v":{"v":0,"d":"0.00"}},{"$f":"VLOOKUP(R$5,Year_One[],4)","v":{"v":0,"d":"0.00"}},{"$f":"VLOOKUP(S$5,Year_One[],4)","v":{"v":0,"d":"0.00"}},{"$f":"VLOOKUP(T$5,Year_One[],4)","v":{"v":0,"d":"0.00"}},{"$f":"VLOOKUP(U$5,Year_One[],4)","v":{"v":0,"d":"0.00"}},{"$f":"VLOOKUP(V$5,Year_One[],4)","v":{"v":0,"d":"0.00"}},{"$f":"VLOOKUP(W$5,Year_One[],4)","v":{"v":0,"d":"0.00"}},{"$f":"VLOOKUP(X$5,Year_One[],4)","v":{"v":0,"d":"0.00"}},{"$f":"VLOOKUP(Y$5,Year_One[],4)","v":"2Lt Chen"},{"$f":"VLOOKUP(Z$5,Year_One[],4)","v":{"v":0,"d":"0.00"}},{"$f":"VLOOKUP(AA$5,Year_One[],4)","v":{"v":0,"d":"0.00"}},{"$f":"VLOOKUP(AB$5,Year_One[],4)","v":{"v":0,"d":"0.00"}},{"$f":"VLOOKUP(AC$5,Year_One[],4)","v":{"v":0,"d":"0.00"}},{"$f":"VLOOKUP(AD$5,Year_One[],4)","v":{"v":0,"d":"0.00"}},{"$f":"VLOOKUP(AE$5,Year_One[],4)","v":"CO"},{"$f":"VLOOKUP(AF$5,Year_One[],4)","v":"2Lt Chen"},{"$f":"VLOOKUP(AG$5,Year_One[],4)","v":"2Lt Chen"},{"$f":"VLOOKUP(AH$5,Year_One[],4)","v":"2Lt Chen"},{"$f":"VLOOKUP(AI$5,Year_One[],4)","v":"2Lt Chen"},{"$f":"VLOOKUP(AJ$5,Year_One[],4)","v":{"v":0,"d":"0.00"}},{"$f":"VLOOKUP(AK$5,Year_One[],4)","v":{"v":0,"d":"0.00"}},{"$f":"VLOOKUP(AL$5,Year_One[],4)","v":{"v":0,"d":"0.00"}},{"$f":"VLOOKUP(AM$5,Year_One[],4)","v":{"v":0,"d":"0.00"}},{"$f":"VLOOKUP(AN$5,Year_One[],4)","v":{"v":0,"d":"0.00"}},{"$f":"VLOOKUP(AO$5,Year_One[],4)","v":{"v":0,"d":"0.00"}},{"$f":"VLOOKUP(AP$5,Year_One[],4)","v":{"$error":"#N/A"}},{"$f":"VLOOKUP(AQ$5,Year_One[],4)","v":{"$error":"#N/A"}},{"$f":"VLOOKUP(AR$5,Year_One[],4)","v":{"$error":"#N/A"}},{"$f":"VLOOKUP(AS$5,Year_One[],4)","v":{"$error":"#N/A"}},{"$f":"VLOOKUP(AT$5,Year_One[],4)","v":{"$error":"#N/A"}},{"$f":"VLOOKUP(AU$5,Year_One[],4)","v":{"$error":"#N/A"}},{"$f":"VLOOKUP(AV$5,Year_One[],4)","v":{"$error":"#N/A"}}]
[null,null,"Location",{"$f":"VLOOKUP(D$5,Year_One[],5)","v":{"v":0,"d":"0.00"}},{"$f":"VLOOKUP(E$5,Year_One[],5)","v":{"v":0,"d":"0.00"}},{"$f":"VLOOKUP(F$5,Year_One[],5)","v":{"v":0,"d":"0.00"}},{"$f":"VLOOKUP(G$5,Year_One[],5)","v":{"v":0,"d":"0.00"}},{"$f":"VLOOKUP(H$5,Year_One[],5)","v":{"v":0,"d":"0.00"}},{"$f":"VLOOKUP(I$5,Year_One[],5)","v":{"v":0,"d":"0.00"}},{"$f":"VLOOKUP(J$5,Year_One[],5)","v":{"v":0,"d":"0.00"}},{"$f":"VLOOKUP(K$5,Year_One[],5)","v":{"v":0,"d":"0.00"}},{"$f":"VLOOKUP(L$5,Year_One[],5)","v":{"v":0,"d":"0.00"}},{"$f":"VLOOKUP(M$5,Year_One[],5)","v":{"v":0,"d":"0.00"}},{"$f":"VLOOKUP(N$5,Year_One[],5)","v":{"v":0,"d":"0.00"}},{"$f":"VLOOKUP(O$5,Year_One[],5)","v":{"v":0,"d":"0.00"}},{"$f":"VLOOKUP(P$5,Year_One[],5)","v":{"v":0,"d":"0.00"}},{"$f":"VLOOKUP(Q$5,Year_One[],5)","v":{"v":0,"d":"0.00"}},{"$f":"VLOOKUP(R$5,Year_One[],5)","v":{"v":0,"d":"0.00"}},{"$f":"VLOOKUP(S$5,Year_One[],5)","v":{"v":0,"d":"0.00"}},{"$f":"VLOOKUP(T$5,Year_One[],5)","v":{"v":0,"d":"0.00"}},{"$f":"VLOOKUP(U$5,Year_One[],5)","v":{"v":0,"d":"0.00"}},{"$f":"VLOOKUP(V$5,Year_One[],5)","v":{"v":0,"d":"0.00"}},{"$f":"VLOOKUP(W$5,Year_One[],5)","v":{"v":0,"d":"0.00"}},{"$f":"VLOOKUP(X$5,Year_One[],5)","v":{"v":0,"d":"0.00"}},{"$f":"VLOOKUP(Y$5,Year_One[],5)","v":"Green Star Room (A)"},{"$f":"VLOOKUP(Z$5,Year_One[],5)","v":{"v":0,"d":"0.00"}},{"$f":"VLOOKUP(AA$5,Year_One[],5)","v":{"v":0,"d":"0.00"}},{"$f":"VLOOKUP(AB$5,Year_One[],5)","v":{"v":0,"d":"0.00"}},{"$f":"VLOOKUP(AC$5,Year_One[],5)","v":{"v":0,"d":"0.00"}},{"$f":"VLOOKUP(AD$5,Year_One[],5)","v":{"v":0,"d":"0.00"}},{"$f":"VLOOKUP(AE$5,Year_One[],5)","v":"Parking Lot"},{"$f":"VLOOKUP(AF$5,Year_One[],5)","v":"Green Star Room (A)"},{"$f":"VLOOKUP(AG$5,Year_One[],5)","v":"Green Star Room (A)"},{"$f":"VLOOKUP(AH$5,Year_One[],5)","v":"Green Star Room (A)"},{"$f":"VLOOKUP(AI$5,Year_One[],5)","v":"Green Star Room (A)"},{"$f":"VLOOKUP(AJ$5,Year_One[],5)","v":{"v":0,"d":"0.00"}},{"$f":"VLOOKUP(AK$5,Year_One[],5)","v":{"v":0,"d":"0.00"}},{"$f":"VLOOKUP(AL$5,Year_One[],5)","v":{"v":0,"d":"0.00"}},{"$f":"VLOOKUP(AM$5,Year_One[],5)","v":{"v":0,"d":"0.00"}},{"$f":"VLOOKUP(AN$5,Year_One[],5)","v":{"v":0,"d":"0.00"}},{"$f":"VLOOKUP(AO$5,Year_One[],5)","v":{"v":0,"d":"0.00"}},{"$f":"VLOOKUP(AP$5,Year_One[],5)","v":{"$error":"#N/A"}},{"$f":"VLOOKUP(AQ$5,Year_One[],5)","v":{"$error":"#N/A"}},{"$f":"VLOOKUP(AR$5,Year_One[],5)","v":{"$error":"#N/A"}},{"$f":"VLOOKUP(AS$5,Year_One[],5)","v":{"$error":"#N/A"}},{"$f":"VLOOKUP(AT$5,Year_One[],5)","v":{"$error":"#N/A"}},{"$f":"VLOOKUP(AU$5,Year_One[],5)","v":{"$error":"#N/A"}},{"$f":"VLOOKUP(AV$5,Year_One[],5)","v":{"$error":"#N/A"}}]
[null,2,"PO/EO No.",{"$f":"'Master PO Schedule'!D3","v":"Admin"},{"$f":"'Master PO Schedule'!E3","v":"M-108.02"},{"$f":"'Master PO Schedule'!F3","v":"CX05.01"},{"$f":"'Master PO Schedule'!G3","v":"M-121.02a"},{"$f":"'Master PO Schedule'!H3","v":"M-121.03b"},{"$f":"'Master PO Schedule'!I3","v":"M-121.04"},{"$f":"'Master PO Schedule'!J3","v":"M-121.06"},{"$f":"'Master PO Schedule'!K3","v":"M-108.04"},{"$f":"'Master PO Schedule'!L3","v":"M-108.06"},{"$f":"'Master PO Schedule'!M3","v":"M-108.08"},{"$f":"'Master PO Schedule'!N3","v":"M-107.03"},{"$f":"'Master PO Schedule'!O3","v":"C-107.04"},{"$f":"'Master PO Schedule'!P3","v":"CX05.01"},{"$f":"'Master PO Schedule'!Q3","v":"Christmas"},{"$f":"'Master PO Schedule'!R3","v":"Christmas"},{"$f":"'Master PO Schedule'!S3","v":"Christmas"},{"$f":"'Master PO Schedule'!T3","v":"M-107.05b"},{"$f":"'Master PO Schedule'!U3","v":"M-107.05b"},{"$f":"'Master PO Schedule'!V3","v":"Stand Down"},{"$f":"'Master PO Schedule'!W3","v":"C-107.04"},{"$f":"'Master PO Schedule'!X3","v":"CX20.01"},{"$f":"'Master PO Schedule'!Y3","v":"M-122.02a"},{"$f":"'Master PO Schedule'!Z3","v":"CX05.01"},{"$f":"'Master PO Schedule'!AA3","v":"M-122.04"},{"$f":"'Master PO Schedule'!AB3","v":"CX05.01"},{"$f":"'Master PO Schedule'!AC3","v":"M-122.04"},{"$f":"'Master PO Schedule'!AD3","v":"March Break"},{"$f":"'Master PO Schedule'!AE3","v":"C-122.01a"},{"$f":"'Master PO Schedule'!AF3","v":"C-122.01b"},{"$f":"'Master PO Schedule'!AG3","v":"C-122.01e"},{"$f":"'Master PO Schedule'!AH3","v":"C-122.01h"},{"$f":"'Master PO Schedule'!AI3","v":"C-122.01k"},{"$f":"'Master PO Schedule'!AJ3","v":"C-122.01l"},{"$f":"'Master PO Schedule'!AK3","v":"C-122.01l"},{"$f":"'Master PO Schedule'!AL3","v":"M108.02"},{"$f":"'Master PO Schedule'!AM3","v":"M108.05"},{"$f":"'Master PO Schedule'!AN3","v":"M108.09"},{"$f":"'Master PO Schedule'!AO3","v":"M108.12"},{"$f":"'Master PO Schedule'!AP3","v":{"v":0,"d":"0.00"}},{"$f":"'Master PO Schedule'!AQ3","v":{"v":0,"d":"0.00"}},{"$f":"'Master PO Schedule'!AR3","v":{"v":0,"d":"0.00"}},{"$f":"'Master PO Schedule'!AS3","v":{"v":0,"d":"0.00"}},{"$f":"'Master PO Schedule'!AT3","v":{"v":0,"d":"0.00"}},{"$f":"'Master PO Schedule'!AU3","v":{"v":0,"d":"0.00"}},{"$f":"'Master PO Schedule'!AV3","v":{"v":0,"d":"0.00"}}]
[null,null,"PO Title",{"$f":"VLOOKUP(D$9,Year_One[],3)","v":"Annual Review"},{"$f":"VLOOKUP(E$9,Year_One[],3)","v":"Drill"},{"$f":"VLOOKUP(F$9,Year_One[],3)","v":"Physical Activities"},{"$f":"VLOOKUP(G$9,Year_One[],3)","v":"Field Training"},{"$f":"VLOOKUP(H$9,Year_One[],3)","v":"Field Training"},{"$f":"VLOOKUP(I$9,Year_One[],3)","v":"Field Training"},{"$f":"VLOOKUP(J$9,Year_One[],3)","v":"Field Training"},{"$f":"VLOOKUP(K$9,Year_One[],3)","v":"Drill"},{"$f":"VLOOKUP(L$9,Year_One[],3)","v":"Drill"},{"$f":"VLOOKUP(M$9,Year_One[],3)","v":"Drill"},{"$f":"VLOOKUP(N$9,Year_One[],3)","v":"GCK"},{"$f":"VLOOKUP(O$9,Year_One[],3)","v":"GCK"},{"$f":"VLOOKUP(P$9,Year_One[],3)","v":"Physical Activities"},{"$f":"VLOOKUP(Q$9,Year_One[],3)","v":"No Training"},{"$f":"VLOOKUP(R$9,Year_One[],3)","v":"No Training"},{"$f":"VLOOKUP(S$9,Year_One[],3)","v":"No Training"},{"$f":"VLOOKUP(T$9,Year_One[],3)","v":"GCK"},{"$f":"VLOOKUP(U$9,Year_One[],3)","v":"GCK"},{"$f":"VLOOKUP(V$9,Year_One[],3)","v":{"v":0,"d":"0.00"}},{"$f":"VLOOKUP(W$9,Year_One[],3)","v":"GCK"},{"$f":"VLOOKUP(X$9,Year_One[],3)","v":"CAF Famil"},{"$f":"VLOOKUP(Y$9,Year_One[],3)","v":"Navigation"},{"$f":"VLOOKUP(Z$9,Year_One[],3)","v":"Physical Activities"},{"$f":"VLOOKUP(AA$9,Year_One[],3)","v":"Navigation"},{"$f":"VLOOKUP(AB$9,Year_One[],3)","v":"Physical Activities"},{"$f":"VLOOKUP(AC$9,Year_One[],3)","v":"Navigation"},{"$f":"VLOOKUP(AD$9,Year_One[],3)","v":"No Training"},{"$f":"VLOOKUP(AE$9,Year_One[],3)","v":"Navigation"},{"$f":"VLOOKUP(AF$9,Year_One[],3)","v":"Navigation"},{"$f":"VLOOKUP(AG$9,Year_One[],3)","v":"Navigation"},{"$f":"VLOOKUP(AH$9,Year_One[],3)","v":"Navigation"},{"$f":"VLOOKUP(AI$9,Year_One[],3)","v":"Navigation"},{"$f":"VLOOKUP(AJ$9,Year_One[],3)","v":"Navigation"},{"$f":"VLOOKUP(AK$9,Year_One[],3)","v":"Navigation"},{"$f":"VLOOKUP(AL$9,Year_One[],3)","v":"Drill"},{"$f":"VLOOKUP(AM$9,Year_One[],3)","v":"Drill"},{"$f":"VLOOKUP(AN$9,Year_One[],3)","v":"Drill"},{"$f":"VLOOKUP(AO$9,Year_One[],3)","v":"Drill"},{"$f":"VLOOKUP(AP$9,Year_One[],3)","v":{"$error":"#N/A"}},{"$f":"VLOOKUP(AQ$9,Year_One[],3)","v":{"$error":"#N/A"}},{"$f":"VLOOKUP(AR$9,Year_One[],3)","v":{"$error":"#N/A"}},{"$f":"VLOOKUP(AS$9,Year_One[],3)","v":{"$error":"#N/A"}},{"$f":"VLOOKUP(AT$9,Year_One[],3)","v":{"$error":"#N/A"}},{"$f":"VLOOKUP(AU$9,Year_One[],3)","v":{"$error":"#N/A"}},{"$f":"VLOOKUP(AV$9,Year_One[],3)","v":{"$error":"#N/A"}}]
[null,null,"Instructor",{"$f":"VLOOKUP(D$9,Year_One[],4)","v":{"v":0,"d":"0.00"}},{"$f":"VLOOKUP(E$9,Year_One[],4)","v":{"v":0,"d":"0.00"}},{"$f":"VLOOKUP(F$9,Year_One[],4)","v":{"v":0,"d":"0.00"}},{"$f":"VLOOKUP(G$9,Year_One[],4)","v":{"v":0,"d":"0.00"}},{"$f":"VLOOKUP(H$9,Year_One[],4)","v":{"v":0,"d":"0.00"}},{"$f":"VLOOKUP(I$9,Year_One[],4)","v":{"v":0,"d":"0.00"}},{"$f":"VLOOKUP(J$9,Year_One[],4)","v":{"v":0,"d":"0.00"}},{"$f":"VLOOKUP(K$9,Year_One[],4)","v":{"v":0,"d":"0.00"}},{"$f":"VLOOKUP(L$9,Year_One[],4)","v":{"v":0,"d":"0.00"}},{"$f":"VLOOKUP(M$9,Year_One[],4)","v":{"v":0,"d":"0.00"}},{"$f":"VLOOKUP(N$9,Year_One[],4)","v":{"v":0,"d":"0.00"}},{"$f":"VLOOKUP(O$9,Year_One[],4)","v":{"v":0,"d":"0.00"}},{"$f":"VLOOKUP(P$9,Year_One[],4)","v":{"v":0,"d":"0.00"}},{"$f":"VLOOKUP(Q$9,Year_One[],4)","v":{"v":0,"d":"0.00"}},{"$f":"VLOOKUP(R$9,Year_One[],4)","v":{"v":0,"d":"0.00"}},{"$f":"VLOOKUP(S$9,Year_One[],4)","v":{"v":0,"d":"0.00"}},{"$f":"VLOOKUP(T$9,Year_One[],4)","v":{"v":0,"d":"0.00"}},{"$f":"VLOOKUP(U$9,Year_One[],4)","v":{"v":0,"d":"0.00"}},{"$f":"VLOOKUP(V$9,Year_One[],4)","v":{"v":0,"d":"0.00"}},{"$f":"VLOOKUP(W$9,Year_One[],4)","v":{"v":0,"d":"0.00"}},{"$f":"VLOOKUP(X$9,Year_One[],4)","v":{"v":0,"d":"0.00"}},{"$f":"VLOOKUP(Y$9,Year_One[],4)","v":{"v":0,"d":"0.00"}},{"$f":"VLOOKUP(Z$9,Year_One[],4)","v":{"v":0,"d":"0.00"}},{"$f":"VLOOKUP(AA$9,Year_One[],4)","v":{"v":0,"d":"0.00"}},{"$f":"VLOOKUP(AB$9,Year_One[],4)","v":{"v":0,"d":"0.00"}},{"$f":"VLOOKUP(AC$9,Year_One[],4)","v":{"v":0,"d":"0.00"}},{"$f":"VLOOKUP(AD$9,Year_One[],4)","v":{"v":0,"d":"0.00"}},{"$f":"VLOOKUP(AE$9,Year_One[],4)","v":"2Lt Chen"},{"$f":"VLOOKUP(AF$9,Year_One[],4)","v":"2Lt Chen"},{"$f":"VLOOKUP(AG$9,Year_One[],4)","v":"2Lt Chen"},{"$f":"VLOOKUP(AH$9,Year_One[],4)","v":"2Lt Chen"},{"$f":"VLOOKUP(AI$9,Year_One[],4)","v":"2Lt Chen"},{"$f":"VLOOKUP(AJ$9,Year_One[],4)","v":"2Lt Chen"},{"$f":"VLOOKUP(AK$9,Year_One[],4)","v":"2Lt Chen"},{"$f":"VLOOKUP(AL$9,Year_One[],4)","v":{"v":0,"d":"0.00"}},{"$f":"VLOOKUP(AM$9,Year_One[],4)","v":{"v":0,"d":"0.00"}},{"$f":"VLOOKUP(AN$9,Year_One[],4)","v":{"v":0,"d":"0.00"}},{"$f":"VLOOKUP(AO$9,Year_One[],4)","v":{"v":0,"d":"0.00"}},{"$f":"VLOOKUP(AP$9,Year_One[],4)","v":{"$error":"#N/A"}},{"$f":"VLOOKUP(AQ$9,Year_One[],4)","v":{"$error":"#N/A"}},{"$f":"VLOOKUP(AR$9,Year_One[],4)","v":{"$error":"#N/A"}},{"$f":"VLOOKUP(AS$9,Year_One[],4)","v":{"$error":"#N/A"}},{"$f":"VLOOKUP(AT$9,Year_One[],4)","v":{"$error":"#N/A"}},{"$f":"VLOOKUP(AU$9,Year_One[],4)","v":{"$error":"#N/A"}},{"$f":"VLOOKUP(AV$9,Year_One[],4)","v":{"$error":"#N/A"}}]
[null,null,"Location",{"$f":"VLOOKUP(D$9,Year_One[],5)","v":{"v":0,"d":"0.00"}},{"$f":"VLOOKUP(E$9,Year_One[],5)","v":{"v":0,"d":"0.00"}},{"$f":"VLOOKUP(F$9,Year_One[],5)","v":{"v":0,"d":"0.00"}},{"$f":"VLOOKUP(G$9,Year_One[],5)","v":{"v":0,"d":"0.00"}},{"$f":"VLOOKUP(H$9,Year_One[],5)","v":{"v":0,"d":"0.00"}},{"$f":"VLOOKUP(I$9,Year_One[],5)","v":{"v":0,"d":"0.00"}},{"$f":"VLOOKUP(J$9,Year_One[],5)","v":{"v":0,"d":"0.00"}},{"$f":"VLOOKUP(K$9,Year_One[],5)","v":{"v":0,"d":"0.00"}},{"$f":"VLOOKUP(L$9,Year_One[],5)","v":{"v":0,"d":"0.00"}},{"$f":"VLOOKUP(M$9,Year_One[],5)","v":{"v":0,"d":"0.00"}},{"$f":"VLOOKUP(N$9,Year_One[],5)","v":{"v":0,"d":"0.00"}},{"$f":"VLOOKUP(O$9,Year_One[],5)","v":{"v":0,"d":"0.00"}},{"$f":"VLOOKUP(P$9,Year_One[],5)","v":{"v":0,"d":"0.00"}},{"$f":"VLOOKUP(Q$9,Year_One[],5)","v":{"v":0,"d":"0.00"}},{"$f":"VLOOKUP(R$9,Year_One[],5)","v":{"v":0,"d":"0.00"}},{"$f":"VLOOKUP(S$9,Year_One[],5)","v":{"v":0,"d":"0.00"}},{"$f":"VLOOKUP(T$9,Year_One[],5)","v":{"v":0,"d":"0.00"}},{"$f":"VLOOKUP(U$9,Year_One[],5)","v":{"v":0,"d":"0.00"}},{"$f":"VLOOKUP(V$9,Year_One[],5)","v":{"v":0,"d":"0.00"}},{"$f":"VLOOKUP(W$9,Year_One[],5)","v":{"v":0,"d":"0.00"}},{"$f":"VLOOKUP(X$9,Year_One[],5)","v":{"v":0,"d":"0.00"}},{"$f":"VLOOKUP(Y$9,Year_One[],5)","v":{"v":0,"d":"0.00"}},{"$f":"VLOOKUP(Z$9,Year_One[],5)","v":{"v":0,"d":"0.00"}},{"$f":"VLOOKUP(AA$9,Year_One[],5)","v":{"v":0,"d":"0.00"}},{"$f":"VLOOKUP(AB$9,Year_One[],5)","v":{"v":0,"d":"0.00"}},{"$f":"VLOOKUP(AC$9,Year_One[],5)","v":{"v":0,"d":"0.00"}},{"$f":"VLOOKUP(AD$9,Year_One[],5)","v":{"v":0,"d":"0.00"}},{"$f":"VLOOKUP(AE$9,Year_One[],5)","v":"Green Star Room (A)"},{"$f":"VLOOKUP(AF$9,Year_One[],5)","v":"Green Star Room (A)"},{"$f":"VLOOKUP(AG$9,Year_One[],5)","v":"Green Star Room (A)"},{"$f":"VLOOKUP(AH$9,Year_One[],5)","v":"Green Star Room (A)"},{"$f":"VLOOKUP(AI$9,Year_One[],5)","v":"Green Star Room (A)"},{"$f":"VLOOKUP(AJ$9,Year_One[],5)","v":"Green Star Room (A)"},{"$f":"VLOOKUP(AK$9,Year_One[],5)","v":"Green Star Room (A)"},{"$f":"VLOOKUP(AL$9,Year_One[],5)","v":{"v":0,"d":"0.00"}},{"$f":"VLOOKUP(AM$9,Year_One[],5)","v":{"v":0,"d":"0.00"}},{"$f":"VLOOKUP(AN$9,Year_One[],5)","v":{"v":0,"d":"0.00"}},{"$f":"VLOOKUP(AO$9,Year_One[],5)","v":{"v":0,"d":"0.00"}},{"$f":"VLOOKUP(AP$9,Year_One[],5)","v":{"$error":"#N/A"}},{"$f":"VLOOKUP(AQ$9,Year_One[],5)","v":{"$error":"#N/A"}},{"$f":"VLOOKUP(AR$9,Year_One[],5)","v":{"$error":"#N/A"}},{"$f":"VLOOKUP(AS$9,Year_One[],5)","v":{"$error":"#N/A"}},{"$f":"VLOOKUP(AT$9,Year_One[],5)","v":{"$error":"#N/A"}},{"$f":"VLOOKUP(AU$9,Year_One[],5)","v":{"$error":"#N/A"}},{"$f":"VLOOKUP(AV$9,Year_One[],5)","v":{"$error":"#N/A"}}]
[null,3,"PO/EO No.",{"$f":"'Master PO Schedule'!D4","v":"Admin"},{"$f":"'Master PO Schedule'!E4","v":"M-121.01a"},{"$f":"'Master PO Schedule'!F4","v":"CX05.01"},{"$f":"'Master PO Schedule'!G4","v":"M-121.02b"},{"$f":"'Master PO Schedule'!H4","v":"M-PSRY.01a"},{"$f":"'Master PO Schedule'!I4","v":"M-PSRY.01b"},{"$f":"'Master PO Schedule'!J4","v":"M-PSRY.02"},{"$f":"'Master PO Schedule'!K4","v":"M-PSRY.03"},{"$f":"'Master PO Schedule'!L4","v":"M-PSRY.04a"},{"$f":"'Master PO Schedule'!M4","v":"M-PSRY.04b"},{"$f":"'Master PO Schedule'!N4","v":"M-107.04"},{"$f":"'Master PO Schedule'!O4","v":"M-103.01"},{"$f":"'Master PO Schedule'!P4","v":"CX05.01"},{"$f":"'Master PO Schedule'!Q4","v":"Christmas"},{"$f":"'Master PO Schedule'!R4","v":"Christmas"},{"$f":"'Master PO Schedule'!S4","v":"Christmas"},{"$f":"'Master PO Schedule'!T4","v":"M-107.06"},{"$f":"'Master PO Schedule'!U4","v":"M-107.06"},{"$f":"'Master PO Schedule'!V4","v":"Stand Down"},{"$f":"'Master PO Schedule'!W4","v":"M-103.01"},{"$f":"'Master PO Schedule'!X4","v":"CX20.01"},{"$f":"'Master PO Schedule'!Y4","v":"M-122.02b"},{"$f":"'Master PO Schedule'!Z4","v":"CX05.01"},{"$f":"'Master PO Schedule'!AA4","v":"M-123.01"},{"$f":"'Master PO Schedule'!AB4","v":"CX05.01"},{"$f":"'Master PO Schedule'!AC4","v":"M-123.01"},{"$f":"'Master PO Schedule'!AD4","v":"March Break"},{"$f":"'Master PO Schedule'!AE4","v":"C-122.01b"},{"$f":"'Master PO Schedule'!AF4","v":"C-122.01c"},{"$f":"'Master PO Schedule'!AG4","v":"C-122.01f"},{"$f":"'Master PO Schedule'!AH4","v":"C-122.01i"},{"$f":"'Master PO Schedule'!AI4","v":"M-122.05a"},{"$f":"'Master PO Schedule'!AJ4","v":"C-103.01"},{"$f":"'Master PO Schedule'!AK4","v":"C-103.01"},{"$f":"'Master PO Schedule'!AL4","v":"M108.03"},{"$f":"'Master PO Schedule'!AM4","v":"M108.07"},{"$f":"'Master PO Schedule'!AN4","v":"M108.10"},{"$f":"'Master PO Schedule'!AO4","v":"M108.12"},{"$f":"'Master PO Schedule'!AP4","v":{"v":0,"d":"0.00"}},{"$f":"'Master PO Schedule'!AQ4","v":{"v":0,"d":"0.00"}},{"$f":"'Master PO Schedule'!AR4","v":{"v":0,"d":"0.00"}},{"$f":"'Master PO Schedule'!AS4","v":{"v":0,"d":"0.00"}},{"$f":"'Master PO Schedule'!AT4","v":{"v":0,"d":"0.00"}},{"$f":"'Master PO Schedule'!AU4","v":{"v":0,"d":"0.00"}},{"$f":"'Master PO Schedule'!AV4","v":{"v":0,"d":"0.00"}}]
[null,null,"PO Title",{"$f":"VLOOKUP(D$13,Year_One[],3)","v":"Annual Review"},{"$f":"VLOOKUP(E$13,Year_One[],3)","v":"Field Training"},{"$f":"VLOOKUP(F$13,Year_One[],3)","v":"Physical Activities"},{"$f":"VLOOKUP(G$13,Year_One[],3)","v":"Field Training"},{"$f":"VLOOKUP(H$13,Year_One[],3)","v":"No Training"},{"$f":"VLOOKUP(I$13,Year_One[],3)","v":"No Training"},{"$f":"VLOOKUP(J$13,Year_One[],3)","v":"No Training"},{"$f":"VLOOKUP(K$13,Year_One[],3)","v":"No Training"},{"$f":"VLOOKUP(L$13,Year_One[],3)","v":"No Training"},{"$f":"VLOOKUP(M$13,Year_One[],3)","v":"No Training"},{"$f":"VLOOKUP(N$13,Year_One[],3)","v":"GCK"},{"$f":"VLOOKUP(O$13,Year_One[],3)","v":"Leadership"},{"$f":"VLOOKUP(P$13,Year_One[],3)","v":"Physical Activities"},{"$f":"VLOOKUP(Q$13,Year_One[],3)","v":"No Training"},{"$f":"VLOOKUP(R$13,Year_One[],3)","v":"No Training"},{"$f":"VLOOKUP(S$13,Year_One[],3)","v":"No Training"},{"$f":"VLOOKUP(T$13,Year_One[],3)","v":"GCK"},{"$f":"VLOOKUP(U$13,Year_One[],3)","v":"GCK"},{"$f":"VLOOKUP(V$13,Year_One[],3)","v":{"v":0,"d":"0.00"}},{"$f":"VLOOKUP(W$13,Year_One[],3)","v":"Leadership"},{"$f":"VLOOKUP(X$13,Year_One[],3)","v":"CAF Famil"},{"$f":"VLOOKUP(Y$13,Year_One[],3)","v":"Navigation"},{"$f":"VLOOKUP(Z$13,Year_One[],3)","v":"Physical Activities"},{"$f":"VLOOKUP(AA$13,Year_One[],3)","v":"Trekking"},{"$f":"VLOOKUP(AB$13,Year_One[],3)","v":"Physical Activities"},{"$f":"VLOOKUP(AC$13,Year_One[],3)","v":"Trekking"},{"$f":"VLOOKUP(AD$13,Year_One[],3)","v":"No Training"},{"$f":"VLOOKUP(AE$13,Year_One[],3)","v":"Navigation"},{"$f":"VLOOKUP(AF$13,Year_One[],3)","v":"Navigation"},{"$f":"VLOOKUP(AG$13,Year_One[],3)","v":"Navigation"},{"$f":"VLOOKUP(AH$13,Year_One[],3)","v":"Navigation"},{"$f":"VLOOKUP(AI$13,Year_One[],3)","v":"Navigation"},{"$f":"VLOOKUP(AJ$13,Year_One[],3)","v":"Leadership"},{"$f":"VLOOKUP(AK$13,Year_One[],3)","v":"Leadership"},{"$f":"VLOOKUP(AL$13,Year_One[],3)","v":"Drill"},{"$f":"VLOOKUP(AM$13,Year_One[],3)","v":"Drill"},{"$f":"VLOOKUP(AN$13,Year_One[],3)","v":"Drill"},{"$f":"VLOOKUP(AO$13,Year_One[],3)","v":"Drill"},{"$f":"VLOOKUP(AP$13,Year_One[],3)","v":{"$error":"#N/A"}},{"$f":"VLOOKUP(AQ$13,Year_One[],3)","v":{"$error":"#N/A"}},{"$f":"VLOOKUP(AR$13,Year_One[],3)","v":{"$error":"#N/A"}},{"$f":"VLOOKUP(AS$13,Year_One[],3)","v":{"$error":"#N/A"}},{"$f":"VLOOKUP(AT$13,Year_One[],3)","v":{"$error":"#N/A"}},{"$f":"VLOOKUP(AU$13,Year_One[],3)","v":{"$error":"#N/A"}},{"$f":"VLOOKUP(AV$13,Year_One[],3)","v":{"$error":"#N/A"}}]
[null,null,"Instructor",{"$f":"VLOOKUP(D$13,Year_One[],4)","v":{"v":0,"d":"0.00"}},{"$f":"VLOOKUP(E$13,Year_One[],4)","v":{"v":0,"d":"0.00"}},{"$f":"VLOOKUP(F$13,Year_One[],4)","v":{"v":0,"d":"0.00"}},{"$f":"VLOOKUP(G$13,Year_One[],4)","v":{"v":0,"d":"0.00"}},{"$f":"VLOOKUP(H$13,Year_One[],4)","v":{"v":0,"d":"0.00"}},{"$f":"VLOOKUP(I$13,Year_One[],4)","v":{"v":0,"d":"0.00"}},{"$f":"VLOOKUP(J$13,Year_One[],4)","v":{"v":0,"d":"0.00"}},{"$f":"VLOOKUP(K$13,Year_One[],4)","v":{"v":0,"d":"0.00"}},{"$f":"VLOOKUP(L$13,Year_One[],4)","v":{"v":0,"d":"0.00"}},{"$f":"VLOOKUP(M$13,Year_One[],4)","v":{"v":0,"d":"0.00"}},{"$f":"VLOOKUP(N$13,Year_One[],4)","v":{"v":0,"d":"0.00"}},{"$f":"VLOOKUP(O$13,Year_One[],4)","v":{"v":0,"d":"0.00"}},{"$f":"VLOOKUP(P$13,Year_One[],4)","v":{"v":0,"d":"0.00"}},{"$f":"VLOOKUP(Q$13,Year_One[],4)","v":{"v":0,"d":"0.00"}},{"$f":"VLOOKUP(R$13,Year_One[],4)","v":{"v":0,"d":"0.00"}},{"$f":"VLOOKUP(S$13,Year_One[],4)","v":{"v":0,"d":"0.00"}},{"$f":"VLOOKUP(T$13,Year_One[],4)","v":{"v":0,"d":"0.00"}},{"$f":"VLOOKUP(U$13,Year_One[],4)","v":{"v":0,"d":"0.00"}},{"$f":"VLOOKUP(V$13,Year_One[],4)","v":{"v":0,"d":"0.00"}},{"$f":"VLOOKUP(W$13,Year_One[],4)","v":{"v":0,"d":"0.00"}},{"$f":"VLOOKUP(X$13,Year_One[],4)","v":{"v":0,"d":"0.00"}},{"$f":"VLOOKUP(Y$13,Year_One[],4)","v":{"v":0,"d":"0.00"}},{"$f":"VLOOKUP(Z$13,Year_One[],4)","v":{"v":0,"d":"0.00"}},{"$f":"VLOOKUP(AA$13,Year_One[],4)","v":{"v":0,"d":"0.00"}},{"$f":"VLOOKUP(AB$13,Year_One[],4)","v":{"v":0,"d":"0.00"}},{"$f":"VLOOKUP(AC$13,Year_One[],4)","v":{"v":0,"d":"0.00"}},{"$f":"VLOOKUP(AD$13,Year_One[],4)","v":{"v":0,"d":"0.00"}},{"$f":"VLOOKUP(AE$13,Year_One[],4)","v":"2Lt Chen"},{"$f":"VLOOKUP(AF$13,Year_One[],4)","v":"2Lt Chen"},{"$f":"VLOOKUP(AG$13,Year_One[],4)","v":"2Lt Chen"},{"$f":"VLOOKUP(AH$13,Year_One[],4)","v":"2Lt Chen"},{"$f":"VLOOKUP(AI$13,Year_One[],4)","v":{"v":0,"d":"0.00"}},{"$f":"VLOOKUP(AJ$13,Year_One[],4)","v":{"v":0,"d":"0.00"}},{"$f":"VLOOKUP(AK$13,Year_One[],4)","v":{"v":0,"d":"0.00"}},{"$f":"VLOOKUP(AL$13,Year_One[],4)","v":{"v":0,"d":"0.00"}},{"$f":"VLOOKUP(AM$13,Year_One[],4)","v":{"v":0,"d":"0.00"}},{"$f":"VLOOKUP(AN$13,Year_One[],4)","v":{"v":0,"d":"0.00"}},{"$f":"VLOOKUP(AO$13,Year_One[],4)","v":{"v":0,"d":"0.00"}},{"$f":"VLOOKUP(AP$13,Year_One[],4)","v":{"$error":"#N/A"}},{"$f":"VLOOKUP(AQ$13,Year_One[],4)","v":{"$error":"#N/A"}},{"$f":"VLOOKUP(AR$13,Year_One[],4)","v":{"$error":"#N/A"}},{"$f":"VLOOKUP(AS$13,Year_One[],4)","v":{"$error":"#N/A"}},{"$f":"VLOOKUP(AT$13,Year_One[],4)","v":{"$error":"#N/A"}},{"$f":"VLOOKUP(AU$13,Year_One[],4)","v":{"$error":"#N/A"}},{"$f":"VLOOKUP(AV$13,Year_One[],4)","v":{"$error":"#N/A"}}]
[null,null,"Location",{"$f":"VLOOKUP(D$13,Year_One[],5)","v":{"v":0,"d":"0.00"}},{"$f":"VLOOKUP(E$13,Year_One[],5)","v":{"v":0,"d":"0.00"}},{"$f":"VLOOKUP(F$13,Year_One[],5)","v":{"v":0,"d":"0.00"}},{"$f":"VLOOKUP(G$13,Year_One[],5)","v":{"v":0,"d":"0.00"}},{"$f":"VLOOKUP(H$13,Year_One[],5)","v":{"v":0,"d":"0.00"}},{"$f":"VLOOKUP(I$13,Year_One[],5)","v":{"v":0,"d":"0.00"}},{"$f":"VLOOKUP(J$13,Year_One[],5)","v":{"v":0,"d":"0.00"}},{"$f":"VLOOKUP(K$13,Year_One[],5)","v":{"v":0,"d":"0.00"}},{"$f":"VLOOKUP(L$13,Year_One[],5)","v":{"v":0,"d":"0.00"}},{"$f":"VLOOKUP(M$13,Year_One[],5)","v":{"v":0,"d":"0.00"}},{"$f":"VLOOKUP(N$13,Year_One[],5)","v":{"v":0,"d":"0.00"}},{"$f":"VLOOKUP(O$13,Year_One[],5)","v":{"v":0,"d":"0.00"}},{"$f":"VLOOKUP(P$13,Year_One[],5)","v":{"v":0,"d":"0.00"}},{"$f":"VLOOKUP(Q$13,Year_One[],5)","v":{"v":0,"d":"0.00"}},{"$f":"VLOOKUP(R$13,Year_One[],5)","v":{"v":0,"d":"0.00"}},{"$f":"VLOOKUP(S$13,Year_One[],5)","v":{"v":0,"d":"0.00"}},{"$f":"VLOOKUP(T$13,Year_One[],5)","v":{"v":0,"d":"0.00"}},{"$f":"VLOOKUP(U$13,Year_One[],5)","v":{"v":0,"d":"0.00"}},{"$f":"VLOOKUP(V$13,Year_One[],5)","v":{"v":0,"d":"0.00"}},{"$f":"VLOOKUP(W$13,Year_One[],5)","v":{"v":0,"d":"0.00"}},{"$f":"VLOOKUP(X$13,Year_One[],5)","v":{"v":0,"d":"0.00"}},{"$f":"VLOOKUP(Y$13,Year_One[],5)","v":{"v":0,"d":"0.00"}},{"$f":"VLOOKUP(Z$13,Year_One[],5)","v":{"v":0,"d":"0.00"}},{"$f":"VLOOKUP(AA$13,Year_One[],5)","v":{"v":0,"d":"0.00"}},{"$f":"VLOOKUP(AB$13,Year_One[],5)","v":{"v":0,"d":"0.00"}},{"$f":"VLOOKUP(AC$13,Year_One[],5)","v":{"v":0,"d":"0.00"}},{"$f":"VLOOKUP(AD$13,Year_One[],5)","v":{"v":0,"d":"0.00"}},{"$f":"VLOOKUP(AE$13,Year_One[],5)","v":"Green Star Room (A)"},{"$f":"VLOOKUP(AF$13,Year_One[],5)","v":"Green Star Room (A)"},{"$f":"VLOOKUP(AG$13,Year_One[],5)","v":"Green Star Room (A)"},{"$f":"VLOOKUP(AH$13,Year_One[],5)","v":"Green Star Room (A)"},{"$f":"VLOOKUP(AI$13,Year_One[],5)","v":{"v":0,"d":"0.00"}},{"$f":"VLOOKUP(AJ$13,Year_One[],5)","v":{"v":0,"d":"0.00"}},{"$f":"VLOOKUP(AK$13,Year_One[],5)","v":{"v":0,"d":"0.00"}},{"$f":"VLOOKUP(AL$13,Year_One[],5)","v":{"v":0,"d":"0.00"}},{"$f":"VLOOKUP(AM$13,Year_One[],5)","v":{"v":0,"d":"0.00"}},{"$f":"VLOOKUP(AN$13,Year_One[],5)","v":{"v":0,"d":"0.00"}},{"$f":"VLOOKUP(AO$13,Year_One[],5)","v":{"v":0,"d":"0.00"}},{"$f":"VLOOKUP(AP$13,Year_One[],5)","v":{"$error":"#N/A"}},{"$f":"VLOOKUP(AQ$13,Year_One[],5)","v":{"$error":"#N/A"}},{"$f":"VLOOKUP(AR$13,Year_One[],5)","v":{"$error":"#N/A"}},{"$f":"VLOOKUP(AS$13,Year_One[],5)","v":{"$error":"#N/A"}},{"$f":"VLOOKUP(AT$13,Year_One[],5)","v":{"$error":"#N/A"}},{"$f":"VLOOKUP(AU$13,Year_One[],5)","v":{"$error":"#N/A"}},{"$f":"VLOOKUP(AV$13,Year_One[],5)","v":{"$error":"#N/A"}}]
["Red Star",1,"PO/EO No.",{"$f":"'Master PO Schedule'!D5","v":"Admin"},{"$f":"'Master PO Schedule'!E5","v":"M-224.01a"},{"$f":"'Master PO Schedule'!F5","v":"CX05.01"},{"$f":"'Master PO Schedule'!G5","v":"C-224.02a"},{"$f":"'Master PO Schedule'!H5","v":"M-221.01"},{"$f":"'Master PO Schedule'!I5","v":"M-221.03a"},{"$f":"'Master PO Schedule'!J5","v":"M-221.05a"},{"$f":"'Master PO Schedule'!K5","v":"M-221.09a"},{"$f":"'Master PO Schedule'!L5","v":"M-208.01a"},{"$f":"'Master PO Schedule'!M5","v":"C-108.01a"},{"$f":"'Master PO Schedule'!N5","v":"C-207.01"},{"$f":"'Master PO Schedule'!O5","v":"M-203.01"},{"$f":"'Master PO Schedule'!P5","v":"CX05.01"},{"$f":"'Master PO Schedule'!Q5","v":"Christmas"},{"$f":"'Master PO Schedule'!R5","v":"Christmas"},{"$f":"'Master PO Schedule'!S5","v":"Christmas"},{"$f":"'Master PO Schedule'!T5","v":"C-206.02a"},{"$f":"'Master PO Schedule'!U5","v":"C-206.02a"},{"$f":"'Master PO Schedule'!V5","v":"Stand Down"},{"$f":"'Master PO Schedule'!W5","v":"M-203.01"},{"$f":"'Master PO Schedule'!X5","v":"MX20.01D"},{"$f":"'Master PO Schedule'!Y5","v":"MX20.01G"},{"$f":"'Master PO Schedule'!Z5","v":"CX05.01"},{"$f":"'Master PO Schedule'!AA5","v":"M-203.01"},{"$f":"'Master PO Schedule'!AB5","v":"CX05.01"},{"$f":"'Master PO Schedule'!AC5","v":"M-203.01"},{"$f":"'Master PO Schedule'!AD5","v":"March Break"},{"$f":"'Master PO Schedule'!AE5","v":"CO Parade"},{"$f":"'Master PO Schedule'!AF5","v":"M222.01"},{"$f":"'Master PO Schedule'!AG5","v":"M222.04"},{"$f":"'Master PO Schedule'!AH5","v":"M223.01"},{"$f":"'Master PO Schedule'!AI5","v":"M224.01"},{"$f":"'Master PO Schedule'!AJ5","v":"M224.04"},{"$f":"'Master PO Schedule'!AK5","v":"M224.04"},{"$f":"'Master PO Schedule'!AL5","v":"C208.01"},{"$f":"'Master PO Schedule'!AM5","v":"C208.01"},{"$f":"'Master PO Schedule'!AN5","v":"C208.01"},{"$f":"'Master PO Schedule'!AO5","v":"C208.01"},{"$f":"'Master PO Schedule'!AP5","v":{"v":0,"d":"0.00"}},{"$f":"'Master PO Schedule'!AQ5","v":{"v":0,"d":"0.00"}},{"$f":"'Master PO Schedule'!AR5","v":{"v":0,"d":"0.00"}},{"$f":"'Master PO Schedule'!AS5","v":{"v":0,"d":"0.00"}},{"$f":"'Master PO Schedule'!AT5","v":{"v":0,"d":"0.00"}},{"$f":"'Master PO Schedule'!AU5","v":{"v":0,"d":"0.00"}},{"$f":"'Master PO Schedule'!AV5","v":{"v":0,"d":"0.00"}}]
[null,null,"PO Title",{"$f":"VLOOKUP(D$17,Year_Two[],3)","v":"Annual Review"},{"$f":"VLOOKUP(E$17,Year_Two[],3)","v":"Wilderness Survival"},{"$f":"VLOOKUP(F$17,Year_Two[],3)","v":"Physical Activities"},{"$f":"VLOOKUP(G$17,Year_Two[],3)","v":"Wilderness Survival"},{"$f":"VLOOKUP(H$17,Year_Two[],3)","v":"Field Training"},{"$f":"VLOOKUP(I$17,Year_Two[],3)","v":"Field Training"},{"$f":"VLOOKUP(J$17,Year_Two[],3)","v":"Field Training"},{"$f":"VLOOKUP(K$17,Year_Two[],3)","v":"Field Training"},{"$f":"VLOOKUP(L$17,Year_Two[],3)","v":"Drill"},{"$f":"VLOOKUP(M$17,Year_Two[],3)","v":"Drill"},{"$f":"VLOOKUP(N$17,Year_Two[],3)","v":"GCK"},{"$f":"VLOOKUP(O$17,Year_Two[],3)","v":"Leadership"},{"$f":"VLOOKUP(P$17,Year_Two[],3)","v":"Physical Activities"},{"$f":"VLOOKUP(Q$17,Year_Two[],3)","v":"No Training"},{"$f":"VLOOKUP(R$17,Year_Two[],3)","v":"No Training"},{"$f":"VLOOKUP(S$17,Year_Two[],3)","v":"No Training"},{"$f":"VLOOKUP(T$17,Year_Two[],3)","v":"Marksmanship"},{"$f":"VLOOKUP(U$17,Year_Two[],3)","v":"Marksmanship"},{"$f":"VLOOKUP(V$17,Year_Two[],3)","v":"Sports"},{"$f":"VLOOKUP(W$17,Year_Two[],3)","v":"Leadership"},{"$f":"VLOOKUP(X$17,Year_Two[],3)","v":"CAF Famil"},{"$f":"VLOOKUP(Y$17,Year_Two[],3)","v":"CAF Famil"},{"$f":"VLOOKUP(Z$17,Year_Two[],3)","v":"Physical Activities"},{"$f":"VLOOKUP(AA$17,Year_Two[],3)","v":"Leadership"},{"$f":"VLOOKUP(AB$17,Year_Two[],3)","v":"Physical Activities"},{"$f":"VLOOKUP(AC$17,Year_Two[],3)","v":"Leadership"},{"$f":"VLOOKUP(AD$17,Year_Two[],3)","v":"No Training"},{"$f":"VLOOKUP(AE$17,Year_Two[],3)","v":"CO's Parade"},{"$f":"VLOOKUP(AF$17,Year_Two[],3)","v":"Navigation"},{"$f":"VLOOKUP(AG$17,Year_Two[],3)","v":"Navigation"},{"$f":"VLOOKUP(AH$17,Year_Two[],3)","v":"Trekking"},{"$f":"VLOOKUP(AI$17,Year_Two[],3)","v":"Wilderness Survival"},{"$f":"VLOOKUP(AJ$17,Year_Two[],3)","v":"Wilderness Survival"},{"$f":"VLOOKUP(AK$17,Year_Two[],3)","v":"Wilderness Survival"},{"$f":"VLOOKUP(AL$17,Year_Two[],3)","v":"Drill"},{"$f":"VLOOKUP(AM$17,Year_Two[],3)","v":"Drill"},{"$f":"VLOOKUP(AN$17,Year_Two[],3)","v":"Drill"},{"$f":"VLOOKUP(AO$17,Year_Two[],3)","v":"Drill"},{"$f":"VLOOKUP(AP$17,Year_Two[],3)","v":{"$error":"#N/A"}},{"$f":"VLOOKUP(AQ$17,Year_Two[],3)","v":{"$error":"#N/A"}},{"$f":"VLOOKUP(AR$17,Year_Two[],3)","v":{"$error":"#N/A"}},{"$f":"VLOOKUP(AS$17,Year_Two[],3)","v":{"$error":"#N/A"}},{"$f":"VLOOKUP(AT$17,Year_Two[],3)","v":{"$error":"#N/A"}},{"$f":"VLOOKUP(AU$17,Year_Two[],3)","v":{"$error":"#N/A"}},{"$f":"VLOOKUP(AV$17,Year_Two[],3)","v":{"$error":"#N/A"}}]
[null,null,"Instructor",{"$f":"VLOOKUP(D$17,Year_Two[],4)","v":{"v":0,"d":"0.00"}},{"$f":"VLOOKUP(E$17,Year_Two[],4)","v":{"v":0,"d":"0.00"}},{"$f":"VLOOKUP(F$17,Year_Two[],4)","v":{"v":0,"d":"0.00"}},{"$f":"VLOOKUP(G$17,Year_Two[],4)","v":{"v":0,"d":"0.00"}},{"$f":"VLOOKUP(H$17,Year_Two[],4)","v":{"v":0,"d":"0.00"}},{"$f":"VLOOKUP(I$17,Year_Two[],4)","v":{"v":0,"d":"0.00"}},{"$f":"VLOOKUP(J$17,Year_Two[],4)","v":{"v":0,"d":"0.00"}},{"$f":"VLOOKUP(K$17,Year_Two[],4)","v":{"v":0,"d":"0.00"}},{"$f":"VLOOKUP(L$17,Year_Two[],4)","v":{"v":0,"d":"0.00"}},{"$f":"VLOOKUP(M$17,Year_Two[],4)","v":{"v":0,"d":"0.00"}},{"$f":"VLOOKUP(N$17,Year_Two[],4)","v":{"v":0,"d":"0.00"}},{"$f":"VLOOKUP(O$17,Year_Two[],4)","v":{"v":0,"d":"0.00"}},{"$f":"VLOOKUP(P$17,Year_Two[],4)","v":{"v":0,"d":"0.00"}},{"$f":"VLOOKUP(Q$17,Year_Two[],4)","v":{"v":0,"d":"0.00"}},{"$f":"VLOOKUP(R$17,Year_Two[],4)","v":{"v":0,"d":"0.00"}},{"$f":"VLOOKUP(S$17,Year_Two[],4)","v":{"v":0,"d":"0.00"}},{"$f":"VLOOKUP(T$17,Year_Two[],4)","v":{"v":0,"d":"0.00"}},{"$f":"VLOOKUP(U$17,Year_Two[],4)","v":{"v":0,"d":"0.00"}},{"$f":"VLOOKUP(V$17,Year_Two[],4)","v":{"v":0,"d":"0.00"}},{"$f":"VLOOKUP(W$17,Year_Two[],4)","v":{"v":0,"d":"0.00"}},{"$f":"VLOOKUP(X$17,Year_Two[],4)","v":{"v":0,"d":"0.00"}},{"$f":"VLOOKUP(Y$17,Year_Two[],4)","v":{"v":0,"d":"0.00"}},{"$f":"VLOOKUP(Z$17,Year_Two[],4)","v":{"v":0,"d":"0.00"}},{"$f":"VLOOKUP(AA$17,Year_Two[],4)","v":{"v":0,"d":"0.00"}},{"$f":"VLOOKUP(AB$17,Year_Two[],4)","v":{"v":0,"d":"0.00"}},{"$f":"VLOOKUP(AC$17,Year_Two[],4)","v":{"v":0,"d":"0.00"}},{"$f":"VLOOKUP(AD$17,Year_Two[],4)","v":{"v":0,"d":"0.00"}},{"$f":"VLOOKUP(AE$17,Year_Two[],4)","v":"CO"},{"$f":"VLOOKUP(AF$17,Year_Two[],4)","v":"WO Ma"},{"$f":"VLOOKUP(AG$17,Year_Two[],4)","v":{"v":0,"d":"0.00"}},{"$f":"VLOOKUP(AH$17,Year_Two[],4)","v":{"v":0,"d":"0.00"}},{"$f":"VLOOKUP(AI$17,Year_Two[],4)","v":{"v":0,"d":"0.00"}},{"$f":"VLOOKUP(AJ$17,Year_Two[],4)","v":{"v":0,"d":"0.00"}},{"$f":"VLOOKUP(AK$17,Year_Two[],4)","v":{"v":0,"d":"0.00"}},{"$f":"VLOOKUP(AL$17,Year_Two[],4)","v":{"v":0,"d":"0.00"}},{"$f":"VLOOKUP(AM$17,Year_Two[],4)","v":{"v":0,"d":"0.00"}},{"$f":"VLOOKUP(AN$17,Year_Two[],4)","v":{"v":0,"d":"0.00"}},{"$f":"VLOOKUP(AO$17,Year_Two[],4)","v":{"v":0,"d":"0.00"}},{"$f":"VLOOKUP(AP$17,Year_Two[],4)","v":{"$error":"#N/A"}},{"$f":"VLOOKUP(AQ$17,Year_Two[],4)","v":{"$error":"#N/A"}},{"$f":"VLOOKUP(AR$17,Year_Two[],4)","v":{"$error":"#N/A"}},{"$f":"VLOOKUP(AS$17,Year_Two[],4)","v":{"$error":"#N/A"}},{"$f":"VLOOKUP(AT$17,Year_Two[],4)","v":{"$error":"#N/A"}},{"$f":"VLOOKUP(AU$17,Year_Two[],4)","v":{"$error":"#N/A"}},{"$f":"VLOOKUP(AV$17,Year_Two[],4)","v":{"$error":"#N/A"}}]
[null,null,"Location",{"$f":"VLOOKUP(D$17,Year_Two[],5)","v":{"v":0,"d":"0.00"}},{"$f":"VLOOKUP(E$17,Year_Two[],5)","v":{"v":0,"d":"0.00"}},{"$f":"VLOOKUP(F$17,Year_Two[],5)","v":{"v":0,"d":"0.00"}},{"$f":"VLOOKUP(G$17,Year_Two[],5)","v":{"v":0,"d":"0.00"}},{"$f":"VLOOKUP(H$17,Year_Two[],5)","v":{"v":0,"d":"0.00"}},{"$f":"VLOOKUP(I$17,Year_Two[],5)","v":{"v":0,"d":"0.00"}},{"$f":"VLOOKUP(J$17,Year_Two[],5)","v":{"v":0,"d":"0.00"}},{"$f":"VLOOKUP(K$17,Year_Two[],5)","v":{"v":0,"d":"0.00"}},{"$f":"VLOOKUP(L$17,Year_Two[],5)","v":{"v":0,"d":"0.00"}},{"$f":"VLOOKUP(M$17,Year_Two[],5)","v":{"v":0,"d":"0.00"}},{"$f":"VLOOKUP(N$17,Year_Two[],5)","v":{"v":0,"d":"0.00"}},{"$f":"VLOOKUP(O$17,Year_Two[],5)","v":{"v":0,"d":"0.00"}},{"$f":"VLOOKUP(P$17,Year_Two[],5)","v":{"v":0,"d":"0.00"}},{"$f":"VLOOKUP(Q$17,Year_Two[],5)","v":{"v":0,"d":"0.00"}},{"$f":"VLOOKUP(R$17,Year_Two[],5)","v":{"v":0,"d":"0.00"}},{"$f":"VLOOKUP(S$17,Year_Two[],5)","v":{"v":0,"d":"0.00"}},{"$f":"VLOOKUP(T$17,Year_Two[],5)","v":{"v":0,"d":"0.00"}},{"$f":"VLOOKUP(U$17,Year_Two[],5)","v":{"v":0,"d":"0.00"}},{"$f":"VLOOKUP(V$17,Year_Two[],5)","v":{"v":0,"d":"0.00"}},{"$f":"VLOOKUP(W$17,Year_Two[],5)","v":{"v":0,"d":"0.00"}},{"$f":"VLOOKUP(X$17,Year_Two[],5)","v":{"v":0,"d":"0.00"}},{"$f":"VLOOKUP(Y$17,Year_Two[],5)","v":{"v":0,"d":"0.00"}},{"$f":"VLOOKUP(Z$17,Year_Two[],5)","v":{"v":0,"d":"0.00"}},{"$f":"VLOOKUP(AA$17,Year_Two[],5)","v":{"v":0,"d":"0.00"}},{"$f":"VLOOKUP(AB$17,Year_Two[],5)","v":{"v":0,"d":"0.00"}},{"$f":"VLOOKUP(AC$17,Year_Two[],5)","v":{"v":0,"d":"0.00"}},{"$f":"VLOOKUP(AD$17,Year_Two[],5)","v":{"v":0,"d":"0.00"}},{"$f":"VLOOKUP(AE$17,Year_Two[],5)","v":"Parking Lot"},{"$f":"VLOOKUP(AF$17,Year_Two[],5)","v":"Back Classroom"},{"$f":"VLOOKUP(AG$17,Year_Two[],5)","v":{"v":0,"d":"0.00"}},{"$f":"VLOOKUP(AH$17,Year_Two[],5)","v":{"v":0,"d":"0.00"}},{"$f":"VLOOKUP(AI$17,Year_Two[],5)","v":{"v":0,"d":"0.00"}},{"$f":"VLOOKUP(AJ$17,Year_Two[],5)","v":{"v":0,"d":"0.00"}},{"$f":"VLOOKUP(AK$17,Year_Two[],5)","v":{"v":0,"d":"0.00"}},{"$f":"VLOOKUP(AL$17,Year_Two[],5)","v":{"v":0,"d":"0.00"}},{"$f":"VLOOKUP(AM$17,Year_Two[],5)","v":{"v":0,"d":"0.00"}},{"$f":"VLOOKUP(AN$17,Year_Two[],5)","v":{"v":0,"d":"0.00"}},{"$f":"VLOOKUP(AO$17,Year_Two[],5)","v":{"v":0,"d":"0.00"}},{"$f":"VLOOKUP(AP$17,Year_Two[],5)","v":{"$error":"#N/A"}},{"$f":"VLOOKUP(AQ$17,Year_Two[],5)","v":{"$error":"#N/A"}},{"$f":"VLOOKUP(AR$17,Year_Two[],5)","v":{"$error":"#N/A"}},{"$f":"VLOOKUP(AS$17,Year_Two[],5)","v":{"$error":"#N/A"}},{"$f":"VLOOKUP(AT$17,Year_Two[],5)","v":{"$error":"#N/A"}},{"$f":"VLOOKUP(AU$17,Year_Two[],5)","v":{"$error":"#N/A"}},{"$f":"VLOOKUP(AV$17,Year_Two[],5)","v":{"$error":"#N/A"}}]
[null,2,"PO/EO No.",{"$f":"'Master PO Schedule'!D6","v":"Admin"},{"$f":"'Master PO Schedule'!E6","v":"M-224.01b"},{"$f":"'Master PO Schedule'!F6","v":"CX05.01"},{"$f":"'Master PO Schedule'!G6","v":"C-224.02b"},{"$f":"'Master PO Schedule'!H6","v":"M-221.02a"},{"$f":"'Master PO Schedule'!I6","v":"M-221.03b"},{"$f":"'Master PO Schedule'!J6","v":"M-221.05b"},{"$f":"'Master PO Schedule'!K6","v":"M-221.09b"},{"$f":"'Master PO Schedule'!L6","v":"M-208.01b"},{"$f":"'Master PO Schedule'!M6","v":"C-108.01b"},{"$f":"'Master PO Schedule'!N6","v":"M-207.03"},{"$f":"'Master PO Schedule'!O6","v":"M-203.02"},{"$f":"'Master PO Schedule'!P6","v":"CX05.01"},{"$f":"'Master PO Schedule'!Q6","v":"Christmas"},{"$f":"'Master PO Schedule'!R6","v":"Christmas"},{"$f":"'Master PO Schedule'!S6","v":"Christmas"},{"$f":"'Master PO Schedule'!T6","v":"C-206.02b"},{"$f":"'Master PO Schedule'!U6","v":"C-206.02b"},{"$f":"'Master PO Schedule'!V6","v":"Stand Down"},{"$f":"'Master PO Schedule'!W6","v":"M-203.02"},{"$f":"'Master PO Schedule'!X6","v":"MX20.01E"},{"$f":"'Master PO Schedule'!Y6","v":"MX01.01A"},{"$f":"'Master PO Schedule'!Z6","v":"CX05.01"},{"$f":"'Master PO Schedule'!AA6","v":"M-203.02"},{"$f":"'Master PO Schedule'!AB6","v":"CX05.01"},{"$f":"'Master PO Schedule'!AC6","v":"M-203.02"},{"$f":"'Master PO Schedule'!AD6","v":"March Break"},{"$f":"'Master PO Schedule'!AE6","v":"M222.01"},{"$f":"'Master PO Schedule'!AF6","v":"M222.02"},{"$f":"'Master PO Schedule'!AG6","v":"M222.05"},{"$f":"'Master PO Schedule'!AH6","v":"M223.02"},{"$f":"'Master PO Schedule'!AI6","v":"M224.02"},{"$f":"'Master PO Schedule'!AJ6","v":"M224.05"},{"$f":"'Master PO Schedule'!AK6","v":"M224.05"},{"$f":"'Master PO Schedule'!AL6","v":"C208.01"},{"$f":"'Master PO Schedule'!AM6","v":"C208.01"},{"$f":"'Master PO Schedule'!AN6","v":"C208.01"},{"$f":"'Master PO Schedule'!AO6","v":"C208.01"},{"$f":"'Master PO Schedule'!AP6","v":{"v":0,"d":"0.00"}},{"$f":"'Master PO Schedule'!AQ6","v":{"v":0,"d":"0.00"}},{"$f":"'Master PO Schedule'!AR6","v":{"v":0,"d":"0.00"}},{"$f":"'Master PO Schedule'!AS6","v":{"v":0,"d":"0.00"}},{"$f":"'Master PO Schedule'!AT6","v":{"v":0,"d":"0.00"}},{"$f":"'Master PO Schedule'!AU6","v":{"v":0,"d":"0.00"}},{"$f":"'Master PO Schedule'!AV6","v":{"v":0,"d":"0.00"}}]
[null,null,"PO Title",{"$f":"VLOOKUP(D$21,Year_Two[],3)","v":"Annual Review"},{"$f":"VLOOKUP(E$21,Year_Two[],3)","v":"Wilderness Survival"},{"$f":"VLOOKUP(F$21,Year_Two[],3)","v":"Physical Activities"},{"$f":"VLOOKUP(G$21,Year_Two[],3)","v":"Wilderness Survival"},{"$f":"VLOOKUP(H$21,Year_Two[],3)","v":"Field Training"},{"$f":"VLOOKUP(I$21,Year_Two[],3)","v":"Field Training"},{"$f":"VLOOKUP(J$21,Year_Two[],3)","v":"Field Training"},{"$f":"VLOOKUP(K$21,Year_Two[],3)","v":"Field Training"},{"$f":"VLOOKUP(L$21,Year_Two[],3)","v":"Drill"},{"$f":"VLOOKUP(M$21,Year_Two[],3)","v":"Drill"},{"$f":"VLOOKUP(N$21,Year_Two[],3)","v":"GCK"},{"$f":"VLOOKUP(O$21,Year_Two[],3)","v":"Leadership"},{"$f":"VLOOKUP(P$21,Year_Two[],3)","v":"Physical Activities"},{"$f":"VLOOKUP(Q$21,Year_Two[],3)","v":"No Training"},{"$f":"VLOOKUP(R$21,Year_Two[],3)","v":"No Training"},{"$f":"VLOOKUP(S$21,Year_Two[],3)","v":"No Training"},{"$f":"VLOOKUP(T$21,Year_Two[],3)","v":"Marksmanship"},{"$f":"VLOOKUP(U$21,Year_Two[],3)","v":"Marksmanship"},{"$f":"VLOOKUP(V$21,Year_Two[],3)","v":"Sports"},{"$f":"VLOOKUP(W$21,Year_Two[],3)","v":"Leadership"},{"$f":"VLOOKUP(X$21,Year_Two[],3)","v":"CAF Famil"},{"$f":"VLOOKUP(Y$21,Year_Two[],3)","v":"Citizenship"},{"$f":"VLOOKUP(Z$21,Year_Two[],3)","v":"Physical Activities"},{"$f":"VLOOKUP(AA$21,Year_Two[],3)","v":"Leadership"},{"$f":"VLOOKUP(AB$21,Year_Two[],3)","v":"Physical Activities"},{"$f":"VLOOKUP(AC$21,Year_Two[],3)","v":"Leadership"},{"$f":"VLOOKUP(AD$21,Year_Two[],3)","v":"No Training"},{"$f":"VLOOKUP(AE$21,Year_Two[],3)","v":"Navigation"},{"$f":"VLOOKUP(AF$21,Year_Two[],3)","v":"Navigation"},{"$f":"VLOOKUP(AG$21,Year_Two[],3)","v":"Navigation"},{"$f":"VLOOKUP(AH$21,Year_Two[],3)","v":"Trekking"},{"$f":"VLOOKUP(AI$21,Year_Two[],3)","v":"Wilderness Survival"},{"$f":"VLOOKUP(AJ$21,Year_Two[],3)","v":"Wilderness Survival"},{"$f":"VLOOKUP(AK$21,Year_Two[],3)","v":"Wilderness Survival"},{"$f":"VLOOKUP(AL$21,Year_Two[],3)","v":"Drill"},{"$f":"VLOOKUP(AM$21,Year_Two[],3)","v":"Drill"},{"$f":"VLOOKUP(AN$21,Year_Two[],3)","v":"Drill"},{"$f":"VLOOKUP(AO$21,Year_Two[],3)","v":"Drill"},{"$f":"VLOOKUP(AP$21,Year_Two[],3)","v":{"$error":"#N/A"}},{"$f":"VLOOKUP(AQ$21,Year_Two[],3)","v":{"$error":"#N/A"}},{"$f":"VLOOKUP(AR$21,Year_Two[],3)","v":{"$error":"#N/A"}},{"$f":"VLOOKUP(AS$21,Year_Two[],3)","v":{"$error":"#N/A"}},{"$f":"VLOOKUP(AT$21,Year_Two[],3)","v":{"$error":"#N/A"}},{"$f":"VLOOKUP(AU$21,Year_Two[],3)","v":{"$error":"#N/A"}},{"$f":"VLOOKUP(AV$21,Year_Two[],3)","v":{"$error":"#N/A"}}]
[null,null,"Instructor",{"$f":"VLOOKUP(D$21,Year_Two[],4)","v":{"v":0,"d":"0.00"}},{"$f":"VLOOKUP(E$21,Year_Two[],4)","v":{"v":0,"d":"0.00"}},{"$f":"VLOOKUP(F$21,Year_Two[],4)","v":{"v":0,"d":"0.00"}},{"$f":"VLOOKUP(G$21,Year_Two[],4)","v":{"v":0,"d":"0.00"}},{"$f":"VLOOKUP(H$21,Year_Two[],4)","v":{"v":0,"d":"0.00"}},{"$f":"VLOOKUP(I$21,Year_Two[],4)","v":{"v":0,"d":"0.00"}},{"$f":"VLOOKUP(J$21,Year_Two[],4)","v":{"v":0,"d":"0.00"}},{"$f":"VLOOKUP(K$21,Year_Two[],4)","v":{"v":0,"d":"0.00"}},{"$f":"VLOOKUP(L$21,Year_Two[],4)","v":{"v":0,"d":"0.00"}},{"$f":"VLOOKUP(M$21,Year_Two[],4)","v":{"v":0,"d":"0.00"}},{"$f":"VLOOKUP(N$21,Year_Two[],4)","v":{"v":0,"d":"0.00"}},{"$f":"VLOOKUP(O$21,Year_Two[],4)","v":{"v":0,"d":"0.00"}},{"$f":"VLOOKUP(P$21,Year_Two[],4)","v":{"v":0,"d":"0.00"}},{"$f":"VLOOKUP(Q$21,Year_Two[],4)","v":{"v":0,"d":"0.00"}},{"$f":"VLOOKUP(R$21,Year_Two[],4)","v":{"v":0,"d":"0.00"}},{"$f":"VLOOKUP(S$21,Year_Two[],4)","v":{"v":0,"d":"0.00"}},{"$f":"VLOOKUP(T$21,Year_Two[],4)","v":{"v":0,"d":"0.00"}},{"$f":"VLOOKUP(U$21,Year_Two[],4)","v":{"v":0,"d":"0.00"}},{"$f":"VLOOKUP(V$21,Year_Two[],4)","v":{"v":0,"d":"0.00"}},{"$f":"VLOOKUP(W$21,Year_Two[],4)","v":{"v":0,"d":"0.00"}},{"$f":"VLOOKUP(X$21,Year_Two[],4)","v":{"v":0,"d":"0.00"}},{"$f":"VLOOKUP(Y$21,Year_Two[],4)","v":{"v":0,"d":"0.00"}},{"$f":"VLOOKUP(Z$21,Year_Two[],4)","v":{"v":0,"d":"0.00"}},{"$f":"VLOOKUP(AA$21,Year_Two[],4)","v":{"v":0,"d":"0.00"}},{"$f":"VLOOKUP(AB$21,Year_Two[],4)","v":{"v":0,"d":"0.00"}},{"$f":"VLOOKUP(AC$21,Year_Two[],4)","v":{"v":0,"d":"0.00"}},{"$f":"VLOOKUP(AD$21,Year_Two[],4)","v":{"v":0,"d":"0.00"}},{"$f":"VLOOKUP(AE$21,Year_Two[],4)","v":"WO Ma"},{"$f":"VLOOKUP(AF$21,Year_Two[],4)","v":"WO Ma"},{"$f":"VLOOKUP(AG$21,Year_Two[],4)","v":{"v":0,"d":"0.00"}},{"$f":"VLOOKUP(AH$21,Year_Two[],4)","v":{"v":0,"d":"0.00"}},{"$f":"VLOOKUP(AI$21,Year_Two[],4)","v":{"v":0,"d":"0.00"}},{"$f":"VLOOKUP(AJ$21,Year_Two[],4)","v":{"v":0,"d":"0.00"}},{"$f":"VLOOKUP(AK$21,Year_Two[],4)","v":{"v":0,"d":"0.00"}},{"$f":"VLOOKUP(AL$21,Year_Two[],4)","v":{"v":0,"d":"0.00"}},{"$f":"VLOOKUP(AM$21,Year_Two[],4)","v":{"v":0,"d":"0.00"}},{"$f":"VLOOKUP(AN$21,Year_Two[],4)","v":{"v":0,"d":"0.00"}},{"$f":"VLOOKUP(AO$21,Year_Two[],4)","v":{"v":0,"d":"0.00"}},{"$f":"VLOOKUP(AP$21,Year_Two[],4)","v":{"$error":"#N/A"}},{"$f":"VLOOKUP(AQ$21,Year_Two[],4)","v":{"$error":"#N/A"}},{"$f":"VLOOKUP(AR$21,Year_Two[],4)","v":{"$error":"#N/A"}},{"$f":"VLOOKUP(AS$21,Year_Two[],4)","v":{"$error":"#N/A"}},{"$f":"VLOOKUP(AT$21,Year_Two[],4)","v":{"$error":"#N/A"}},{"$f":"VLOOKUP(AU$21,Year_Two[],4)","v":{"$error":"#N/A"}},{"$f":"VLOOKUP(AV$21,Year_Two[],4)","v":{"$error":"#N/A"}}]
[null,null,"Location",{"$f":"VLOOKUP(D$21,Year_Two[],5)","v":{"v":0,"d":"0.00"}},{"$f":"VLOOKUP(E$21,Year_Two[],5)","v":{"v":0,"d":"0.00"}},{"$f":"VLOOKUP(F$21,Year_Two[],5)","v":{"v":0,"d":"0.00"}},{"$f":"VLOOKUP(G$21,Year_Two[],5)","v":{"v":0,"d":"0.00"}},{"$f":"VLOOKUP(H$21,Year_Two[],5)","v":{"v":0,"d":"0.00"}},{"$f":"VLOOKUP(I$21,Year_Two[],5)","v":{"v":0,"d":"0.00"}},{"$f":"VLOOKUP(J$21,Year_Two[],5)","v":{"v":0,"d":"0.00"}},{"$f":"VLOOKUP(K$21,Year_Two[],5)","v":{"v":0,"d":"0.00"}},{"$f":"VLOOKUP(L$21,Year_Two[],5)","v":{"v":0,"d":"0.00"}},{"$f":"VLOOKUP(M$21,Year_Two[],5)","v":{"v":0,"d":"0.00"}},{"$f":"VLOOKUP(N$21,Year_Two[],5)","v":{"v":0,"d":"0.00"}},{"$f":"VLOOKUP(O$21,Year_Two[],5)","v":{"v":0,"d":"0.00"}},{"$f":"VLOOKUP(P$21,Year_Two[],5)","v":{"v":0,"d":"0.00"}},{"$f":"VLOOKUP(Q$21,Year_Two[],5)","v":{"v":0,"d":"0.00"}},{"$f":"VLOOKUP(R$21,Year_Two[],5)","v":{"v":0,"d":"0.00"}},{"$f":"VLOOKUP(S$21,Year_Two[],5)","v":{"v":0,"d":"0.00"}},{"$f":"VLOOKUP(T$21,Year_Two[],5)","v":{"v":0,"d":"0.00"}},{"$f":"VLOOKUP(U$21,Year_Two[],5)","v":{"v":0,"d":"0.00"}},{"$f":"VLOOKUP(V$21,Year_Two[],5)","v":{"v":0,"d":"0.00"}},{"$f":"VLOOKUP(W$21,Year_Two[],5)","v":{"v":0,"d":"0.00"}},{"$f":"VLOOKUP(X$21,Year_Two[],5)","v":{"v":0,"d":"0.00"}},{"$f":"VLOOKUP(Y$21,Year_Two[],5)","v":{"v":0,"d":"0.00"}},{"$f":"VLOOKUP(Z$21,Year_Two[],5)","v":{"v":0,"d":"0.00"}},{"$f":"VLOOKUP(AA$21,Year_Two[],5)","v":{"v":0,"d":"0.00"}},{"$f":"VLOOKUP(AB$21,Year_Two[],5)","v":{"v":0,"d":"0.00"}},{"$f":"VLOOKUP(AC$21,Year_Two[],5)","v":{"v":0,"d":"0.00"}},{"$f":"VLOOKUP(AD$21,Year_Two[],5)","v":{"v":0,"d":"0.00"}},{"$f":"VLOOKUP(AE$21,Year_Two[],5)","v":"Back Classroom"},{"$f":"VLOOKUP(AF$21,Year_Two[],5)","v":"Back Classroom"},{"$f":"VLOOKUP(AG$21,Year_Two[],5)","v":{"v":0,"d":"0.00"}},{"$f":"VLOOKUP(AH$21,Year_Two[],5)","v":{"v":0,"d":"0.00"}},{"$f":"VLOOKUP(AI$21,Year_Two[],5)","v":{"v":0,"d":"0.00"}},{"$f":"VLOOKUP(AJ$21,Year_Two[],5)","v":{"v":0,"d":"0.00"}},{"$f":"VLOOKUP(AK$21,Year_Two[],5)","v":{"v":0,"d":"0.00"}},{"$f":"VLOOKUP(AL$21,Year_Two[],5)","v":{"v":0,"d":"0.00"}},{"$f":"VLOOKUP(AM$21,Year_Two[],5)","v":{"v":0,"d":"0.00"}},{"$f":"VLOOKUP(AN$21,Year_Two[],5)","v":{"v":0,"d":"0.00"}},{"$f":"VLOOKUP(AO$21,Year_Two[],5)","v":{"v":0,"d":"0.00"}},{"$f":"VLOOKUP(AP$21,Year_Two[],5)","v":{"$error":"#N/A"}},{"$f":"VLOOKUP(AQ$21,Year_Two[],5)","v":{"$error":"#N/A"}},{"$f":"VLOOKUP(AR$21,Year_Two[],5)","v":{"$error":"#N/A"}},{"$f":"VLOOKUP(AS$21,Year_Two[],5)","v":{"$error":"#N/A"}},{"$f":"VLOOKUP(AT$21,Year_Two[],5)","v":{"$error":"#N/A"}},{"$f":"VLOOKUP(AU$21,Year_Two[],5)","v":{"$error":"#N/A"}},{"$f":"VLOOKUP(AV$21,Year_Two[],5)","v":{"$error":"#N/A"}}]
[null,3,"PO/EO No.",{"$f":"'Master PO Schedule'!D7","v":"Admin"},{"$f":"'Master PO Schedule'!E7","v":"M-224.02"},{"$f":"'Master PO Schedule'!F7","v":"CX05.01"},{"$f":"'Master PO Schedule'!G7","v":"M-224.03"},{"$f":"'Master PO Schedule'!H7","v":"M-221.02b"},{"$f":"'Master PO Schedule'!I7","v":"M-221.04"},{"$f":"'Master PO Schedule'!J7","v":"M-221.05c"},{"$f":"'Master PO Schedule'!K7","v":"C-121.02"},{"$f":"'Master PO Schedule'!L7","v":"M-208.02"},{"$f":"'Master PO Schedule'!M7","v":"C-203.06b"},{"$f":"'Master PO Schedule'!N7","v":"C-206.01"},{"$f":"'Master PO Schedule'!O7","v":"CX20.01"},{"$f":"'Master PO Schedule'!P7","v":"CX05.01"},{"$f":"'Master PO Schedule'!Q7","v":"Christmas"},{"$f":"'Master PO Schedule'!R7","v":"Christmas"},{"$f":"'Master PO Schedule'!S7","v":"Christmas"},{"$f":"'Master PO Schedule'!T7","v":"C-206.03"},{"$f":"'Master PO Schedule'!U7","v":"C-206.03"},{"$f":"'Master PO Schedule'!V7","v":"Stand Down"},{"$f":"'Master PO Schedule'!W7","v":"CX20.01"},{"$f":"'Master PO Schedule'!X7","v":"MX20.01F"},{"$f":"'Master PO Schedule'!Y7","v":"MX01.01B"},{"$f":"'Master PO Schedule'!Z7","v":"CX05.01"},{"$f":"'Master PO Schedule'!AA7","v":"M-203.03"},{"$f":"'Master PO Schedule'!AB7","v":"CX05.01"},{"$f":"'Master PO Schedule'!AC7","v":"M-203.03"},{"$f":"'Master PO Schedule'!AD7","v":"March Break"},{"$f":"'Master PO Schedule'!AE7","v":"M222.02"},{"$f":"'Master PO Schedule'!AF7","v":"M222.03"},{"$f":"'Master PO Schedule'!AG7","v":"M222.06"},{"$f":"'Master PO Schedule'!AH7","v":"M223.03"},{"$f":"'Master PO Schedule'!AI7","v":"M224.03"},{"$f":"'Master PO Schedule'!AJ7","v":"M224.06"},{"$f":"'Master PO Schedule'!AK7","v":"M224.06"},{"$f":"'Master PO Schedule'!AL7","v":"C208.01"},{"$f":"'Master PO Schedule'!AM7","v":"C208.01"},{"$f":"'Master PO Schedule'!AN7","v":"C208.01"},{"$f":"'Master PO Schedule'!AO7","v":"C208.01"},{"$f":"'Master PO Schedule'!AP7","v":{"v":0,"d":"0.00"}},{"$f":"'Master PO Schedule'!AQ7","v":{"v":0,"d":"0.00"}},{"$f":"'Master PO Schedule'!AR7","v":{"v":0,"d":"0.00"}},{"$f":"'Master PO Schedule'!AS7","v":{"v":0,"d":"0.00"}},{"$f":"'Master PO Schedule'!AT7","v":{"v":0,"d":"0.00"}},{"$f":"'Master PO Schedule'!AU7","v":{"v":0,"d":"0.00"}},{"$f":"'Master PO Schedule'!AV7","v":{"v":0,"d":"0.00"}}]
[null,null,"PO Title",{"$f":"VLOOKUP(D$25,Year_Two[],3)","v":"Annual Review"},{"$f":"VLOOKUP(E$25,Year_Two[],3)","v":"Wilderness Survival"},{"$f":"VLOOKUP(F$25,Year_Two[],3)","v":"Physical Activities"},{"$f":"VLOOKUP(G$25,Year_Two[],3)","v":"Wilderness Survival"},{"$f":"VLOOKUP(H$25,Year_Two[],3)","v":"Field Training"},{"$f":"VLOOKUP(I$25,Year_Two[],3)","v":"Field Training"},{"$f":"VLOOKUP(J$25,Year_Two[],3)","v":"Field Training"},{"$f":"VLOOKUP(K$25,Year_Two[],3)","v":"Field Training"},{"$f":"VLOOKUP(L$25,Year_Two[],3)","v":"Drill"},{"$f":"VLOOKUP(M$25,Year_Two[],3)","v":"Leadership"},{"$f":"VLOOKUP(N$25,Year_Two[],3)","v":"Marksmanship"},{"$f":"VLOOKUP(O$25,Year_Two[],3)","v":"CAF Famil"},{"$f":"VLOOKUP(P$25,Year_Two[],3)","v":"Physical Activities"},{"$f":"VLOOKUP(Q$25,Year_Two[],3)","v":"No Training"},{"$f":"VLOOKUP(R$25,Year_Two[],3)","v":"No Training"},{"$f":"VLOOKUP(S$25,Year_Two[],3)","v":"No Training"},{"$f":"VLOOKUP(T$25,Year_Two[],3)","v":"Marksmanship"},{"$f":"VLOOKUP(U$25,Year_Two[],3)","v":"Marksmanship"},{"$f":"VLOOKUP(V$25,Year_Two[],3)","v":"Sports"},{"$f":"VLOOKUP(W$25,Year_Two[],3)","v":"CAF Famil"},{"$f":"VLOOKUP(X$25,Year_Two[],3)","v":"CAF Famil"},{"$f":"VLOOKUP(Y$25,Year_Two[],3)","v":"Citizenship"},{"$f":"VLOOKUP(Z$25,Year_Two[],3)","v":"Physical Activities"},{"$f":"VLOOKUP(AA$25,Year_Two[],3)","v":"Leadership"},{"$f":"VLOOKUP(AB$25,Year_Two[],3)","v":"Physical Activities"},{"$f":"VLOOKUP(AC$25,Year_Two[],3)","v":"Leadership"},{"$f":"VLOOKUP(AD$25,Year_Two[],3)","v":"No Training"},{"$f":"VLOOKUP(AE$25,Year_Two[],3)","v":"Navigation"},{"$f":"VLOOKUP(AF$25,Year_Two[],3)","v":"Navigation"},{"$f":"VLOOKUP(AG$25,Year_Two[],3)","v":"Navigation"},{"$f":"VLOOKUP(AH$25,Year_Two[],3)","v":"Trekking"},{"$f":"VLOOKUP(AI$25,Year_Two[],3)","v":"Wilderness Survival"},{"$f":"VLOOKUP(AJ$25,Year_Two[],3)","v":"Wilderness Survival"},{"$f":"VLOOKUP(AK$25,Year_Two[],3)","v":"Wilderness Survival"},{"$f":"VLOOKUP(AL$25,Year_Two[],3)","v":"Drill"},{"$f":"VLOOKUP(AM$25,Year_Two[],3)","v":"Drill"},{"$f":"VLOOKUP(AN$25,Year_Two[],3)","v":"Drill"},{"$f":"VLOOKUP(AO$25,Year_Two[],3)","v":"Drill"},{"$f":"VLOOKUP(AP$25,Year_Two[],3)","v":{"$error":"#N/A"}},{"$f":"VLOOKUP(AQ$25,Year_Two[],3)","v":{"$error":"#N/A"}},{"$f":"VLOOKUP(AR$25,Year_Two[],3)","v":{"$error":"#N/A"}},{"$f":"VLOOKUP(AS$25,Year_Two[],3)","v":{"$error":"#N/A"}},{"$f":"VLOOKUP(AT$25,Year_Two[],3)","v":{"$error":"#N/A"}},{"$f":"VLOOKUP(AU$25,Year_Two[],3)","v":{"$error":"#N/A"}},{"$f":"VLOOKUP(AV$25,Year_Two[],3)","v":{"$error":"#N/A"}}]
[null,null,"Instructor",{"$f":"VLOOKUP(D$25,Year_Two[],4)","v":{"v":0,"d":"0.00"}},{"$f":"VLOOKUP(E$25,Year_Two[],4)","v":{"v":0,"d":"0.00"}},{"$f":"VLOOKUP(F$25,Year_Two[],4)","v":{"v":0,"d":"0.00"}},{"$f":"VLOOKUP(G$25,Year_Two[],4)","v":{"v":0,"d":"0.00"}},{"$f":"VLOOKUP(H$25,Year_Two[],4)","v":{"v":0,"d":"0.00"}},{"$f":"VLOOKUP(I$25,Year_Two[],4)","v":{"v":0,"d":"0.00"}},{"$f":"VLOOKUP(J$25,Year_Two[],4)","v":{"v":0,"d":"0.00"}},{"$f":"VLOOKUP(K$25,Year_Two[],4)","v":{"v":0,"d":"0.00"}},{"$f":"VLOOKUP(L$25,Year_Two[],4)","v":{"v":0,"d":"0.00"}},{"$f":"VLOOKUP(M$25,Year_Two[],4)","v":{"v":0,"d":"0.00"}},{"$f":"VLOOKUP(N$25,Year_Two[],4)","v":{"v":0,"d":"0.00"}},{"$f":"VLOOKUP(O$25,Year_Two[],4)","v":{"v":0,"d":"0.00"}},{"$f":"VLOOKUP(P$25,Year_Two[],4)","v":{"v":0,"d":"0.00"}},{"$f":"VLOOKUP(Q$25,Year_Two[],4)","v":{"v":0,"d":"0.00"}},{"$f":"VLOOKUP(R$25,Year_Two[],4)","v":{"v":0,"d":"0.00"}},{"$f":"VLOOKUP(S$25,Year_Two[],4)","v":{"v":0,"d":"0.00"}},{"$f":"VLOOKUP(T$25,Year_Two[],4)","v":{"v":0,"d":"0.00"}},{"$f":"VLOOKUP(U$25,Year_Two[],4)","v":{"v":0,"d":"0.00"}},{"$f":"VLOOKUP(V$25,Year_Two[],4)","v":{"v":0,"d":"0.00"}},{"$f":"VLOOKUP(W$25,Year_Two[],4)","v":{"v":0,"d":"0.00"}},{"$f":"VLOOKUP(X$25,Year_Two[],4)","v":{"v":0,"d":"0.00"}},{"$f":"VLOOKUP(Y$25,Year_Two[],4)","v":{"v":0,"d":"0.00"}},{"$f":"VLOOKUP(Z$25,Year_Two[],4)","v":{"v":0,"d":"0.00"}},{"$f":"VLOOKUP(AA$25,Year_Two[],4)","v":{"v":0,"d":"0.00"}},{"$f":"VLOOKUP(AB$25,Year_Two[],4)","v":{"v":0,"d":"0.00"}},{"$f":"VLOOKUP(AC$25,Year_Two[],4)","v":{"v":0,"d":"0.00"}},{"$f":"VLOOKUP(AD$25,Year_Two[],4)","v":{"v":0,"d":"0.00"}},{"$f":"VLOOKUP(AE$25,Year_Two[],4)","v":"WO Ma"},{"$f":"VLOOKUP(AF$25,Year_Two[],4)","v":{"v":0,"d":"0.00"}},{"$f":"VLOOKUP(AG$25,Year_Two[],4)","v":{"v":0,"d":"0.00"}},{"$f":"VLOOKUP(AH$25,Year_Two[],4)","v":{"v":0,"d":"0.00"}},{"$f":"VLOOKUP(AI$25,Year_Two[],4)","v":{"v":0,"d":"0.00"}},{"$f":"VLOOKUP(AJ$25,Year_Two[],4)","v":{"v":0,"d":"0.00"}},{"$f":"VLOOKUP(AK$25,Year_Two[],4)","v":{"v":0,"d":"0.00"}},{"$f":"VLOOKUP(AL$25,Year_Two[],4)","v":{"v":0,"d":"0.00"}},{"$f":"VLOOKUP(AM$25,Year_Two[],4)","v":{"v":0,"d":"0.00"}},{"$f":"VLOOKUP(AN$25,Year_Two[],4)","v":{"v":0,"d":"0.00"}},{"$f":"VLOOKUP(AO$25,Year_Two[],4)","v":{"v":0,"d":"0.00"}},{"$f":"VLOOKUP(AP$25,Year_Two[],4)","v":{"$error":"#N/A"}},{"$f":"VLOOKUP(AQ$25,Year_Two[],4)","v":{"$error":"#N/A"}},{"$f":"VLOOKUP(AR$25,Year_Two[],4)","v":{"$error":"#N/A"}},{"$f":"VLOOKUP(AS$25,Year_Two[],4)","v":{"$error":"#N/A"}},{"$f":"VLOOKUP(AT$25,Year_Two[],4)","v":{"$error":"#N/A"}},{"$f":"VLOOKUP(AU$25,Year_Two[],4)","v":{"$error":"#N/A"}},{"$f":"VLOOKUP(AV$25,Year_Two[],4)","v":{"$error":"#N/A"}}]
[null,null,"Location",{"$f":"VLOOKUP(D$25,Year_Two[],5)","v":{"v":0,"d":"0.00"}},{"$f":"VLOOKUP(E$25,Year_Two[],5)","v":{"v":0,"d":"0.00"}},{"$f":"VLOOKUP(F$25,Year_Two[],5)","v":{"v":0,"d":"0.00"}},{"$f":"VLOOKUP(G$25,Year_Two[],5)","v":{"v":0,"d":"0.00"}},{"$f":"VLOOKUP(H$25,Year_Two[],5)","v":{"v":0,"d":"0.00"}},{"$f":"VLOOKUP(I$25,Year_Two[],5)","v":{"v":0,"d":"0.00"}},{"$f":"VLOOKUP(J$25,Year_Two[],5)","v":{"v":0,"d":"0.00"}},{"$f":"VLOOKUP(K$25,Year_Two[],5)","v":{"v":0,"d":"0.00"}},{"$f":"VLOOKUP(L$25,Year_Two[],5)","v":{"v":0,"d":"0.00"}},{"$f":"VLOOKUP(M$25,Year_Two[],5)","v":{"v":0,"d":"0.00"}},{"$f":"VLOOKUP(N$25,Year_Two[],5)","v":{"v":0,"d":"0.00"}},{"$f":"VLOOKUP(O$25,Year_Two[],5)","v":{"v":0,"d":"0.00"}},{"$f":"VLOOKUP(P$25,Year_Two[],5)","v":{"v":0,"d":"0.00"}},{"$f":"VLOOKUP(Q$25,Year_Two[],5)","v":{"v":0,"d":"0.00"}},{"$f":"VLOOKUP(R$25,Year_Two[],5)","v":{"v":0,"d":"0.00"}},{"$f":"VLOOKUP(S$25,Year_Two[],5)","v":{"v":0,"d":"0.00"}},{"$f":"VLOOKUP(T$25,Year_Two[],5)","v":{"v":0,"d":"0.00"}},{"$f":"VLOOKUP(U$25,Year_Two[],5)","v":{"v":0,"d":"0.00"}},{"$f":"VLOOKUP(V$25,Year_Two[],5)","v":{"v":0,"d":"0.00"}},{"$f":"VLOOKUP(W$25,Year_Two[],5)","v":{"v":0,"d":"0.00"}},{"$f":"VLOOKUP(X$25,Year_Two[],5)","v":{"v":0,"d":"0.00"}},{"$f":"VLOOKUP(Y$25,Year_Two[],5)","v":{"v":0,"d":"0.00"}},{"$f":"VLOOKUP(Z$25,Year_Two[],5)","v":{"v":0,"d":"0.00"}},{"$f":"VLOOKUP(AA$25,Year_Two[],5)","v":{"v":0,"d":"0.00"}},{"$f":"VLOOKUP(AB$25,Year_Two[],5)","v":{"v":0,"d":"0.00"}},{"$f":"VLOOKUP(AC$25,Year_Two[],5)","v":{"v":0,"d":"0.00"}},{"$f":"VLOOKUP(AD$25,Year_Two[],5)","v":{"v":0,"d":"0.00"}},{"$f":"VLOOKUP(AE$25,Year_Two[],5)","v":"Back Classroom"},{"$f":"VLOOKUP(AF$25,Year_Two[],5)","v":{"v":0,"d":"0.00"}},{"$f":"VLOOKUP(AG$25,Year_Two[],5)","v":{"v":0,"d":"0.00"}},{"$f":"VLOOKUP(AH$25,Year_Two[],5)","v":{"v":0,"d":"0.00"}},{"$f":"VLOOKUP(AI$25,Year_Two[],5)","v":{"v":0,"d":"0.00"}},{"$f":"VLOOKUP(AJ$25,Year_Two[],5)","v":{"v":0,"d":"0.00"}},{"$f":"VLOOKUP(AK$25,Year_Two[],5)","v":{"v":0,"d":"0.00"}},{"$f":"VLOOKUP(AL$25,Year_Two[],5)","v":{"v":0,"d":"0.00"}},{"$f":"VLOOKUP(AM$25,Year_Two[],5)","v":{"v":0,"d":"0.00"}},{"$f":"VLOOKUP(AN$25,Year_Two[],5)","v":{"v":0,"d":"0.00"}},{"$f":"VLOOKUP(AO$25,Year_Two[],5)","v":{"v":0,"d":"0.00"}},{"$f":"VLOOKUP(AP$25,Year_Two[],5)","v":{"$error":"#N/A"}},{"$f":"VLOOKUP(AQ$25,Year_Two[],5)","v":{"$error":"#N/A"}},{"$f":"VLOOKUP(AR$25,Year_Two[],5)","v":{"$error":"#N/A"}},{"$f":"VLOOKUP(AS$25,Year_Two[],5)","v":{"$error":"#N/A"}},{"$f":"VLOOKUP(AT$25,Year_Two[],5)","v":{"$error":"#N/A"}},{"$f":"VLOOKUP(AU$25,Year_Two[],5)","v":{"$error":"#N/A"}},{"$f":"VLOOKUP(AV$25,Year_Two[],5)","v":{"$error":"#N/A"}}]
["Silver Star",1,"PO/EO No.",{"$f":"'Master PO Schedule'!D8","v":"Admin"},{"$f":"'Master PO Schedule'!E8","v":"MX01.01A"},{"$f":"'Master PO Schedule'!F8","v":"CX05.01"},{"$f":"'Master PO Schedule'!G8","v":"M303.01"},{"$f":"'Master PO Schedule'!H8","v":"M309.01"},{"$f":"'Master PO Schedule'!I8","v":"M309.04"},{"$f":"'Master PO Schedule'!J8","v":"M309.07"},{"$f":"'Master PO Schedule'!K8","v":"M308.01"},{"$f":"'Master PO Schedule'!L8","v":"M308.02"},{"$f":"'Master PO Schedule'!M8","v":"C208.01"},{"$f":"'Master PO Schedule'!N8","v":"C208.02"},{"$f":"'Master PO Schedule'!O8","v":"M309.07"},{"$f":"'Master PO Schedule'!P8","v":"CX05.01"},{"$f":"'Master PO Schedule'!Q8","v":"Christmas"},{"$f":"'Master PO Schedule'!R8","v":"Christmas"},{"$f":"'Master PO Schedule'!S8","v":"Christmas"},{"$f":"'Master PO Schedule'!T8","v":"M309.07"},{"$f":"'Master PO Schedule'!U8","v":"M309.07"},{"$f":"'Master PO Schedule'!V8","v":"Stand Down"},{"$f":"'Master PO Schedule'!W8","v":"M309.07"},{"$f":"'Master PO Schedule'!X8","v":"C203.06"},{"$f":"'Master PO Schedule'!Y8","v":"C309.05"},{"$f":"'Master PO Schedule'!Z8","v":"CX05.01"},{"$f":"'Master PO Schedule'!AA8","v":"Optional IT"},{"$f":"'Master PO Schedule'!AB8","v":"CX05.01"},{"$f":"'Master PO Schedule'!AC8","v":"Optional IT"},{"$f":"'Master PO Schedule'!AD8","v":"March Break"},{"$f":"'Master PO Schedule'!AE8","v":"CO Parade"},{"$f":"'Master PO Schedule'!AF8","v":"M322.01"},{"$f":"'Master PO Schedule'!AG8","v":"M322.04"},{"$f":"'Master PO Schedule'!AH8","v":"C322.01"},{"$f":"'Master PO Schedule'!AI8","v":"M325.02"},{"$f":"'Master PO Schedule'!AJ8","v":"M326.02"},{"$f":"'Master PO Schedule'!AK8","v":"M326.02"},{"$f":"'Master PO Schedule'!AL8","v":"M324.01"},{"$f":"'Master PO Schedule'!AM8","v":"M308.01"},{"$f":"'Master PO Schedule'!AN8","v":"M308.01"},{"$f":"'Master PO Schedule'!AO8","v":"M308.01"},{"$f":"'Master PO Schedule'!AP8","v":{"v":0,"d":"0.00"}},{"$f":"'Master PO Schedule'!AQ8","v":{"v":0,"d":"0.00"}},{"$f":"'Master PO Schedule'!AR8","v":{"v":0,"d":"0.00"}},{"$f":"'Master PO Schedule'!AS8","v":{"v":0,"d":"0.00"}},{"$f":"'Master PO Schedule'!AT8","v":{"v":0,"d":"0.00"}},{"$f":"'Master PO Schedule'!AU8","v":{"v":0,"d":"0.00"}},{"$f":"'Master PO Schedule'!AV8","v":{"v":0,"d":"0.00"}}]
[null,null,"PO Title",{"$f":"VLOOKUP(D29,Year_Three[],3)","v":"Annual Review"},{"$f":"VLOOKUP(E29,Year_Three[],3)","v":"Citizenship"},{"$f":"VLOOKUP(F29,Year_Three[],3)","v":"Physical Activities"},{"$f":"VLOOKUP(G29,Year_Three[],3)","v":"Leadership"},{"$f":"VLOOKUP(H29,Year_Three[],3)","v":"IT"},{"$f":"VLOOKUP(I29,Year_Three[],3)","v":"IT"},{"$f":"VLOOKUP(J29,Year_Three[],3)","v":"IT"},{"$f":"VLOOKUP(K29,Year_Three[],3)","v":"Drill"},{"$f":"VLOOKUP(L29,Year_Three[],3)","v":"Drill"},{"$f":"VLOOKUP(M29,Year_Three[],3)","v":"Drill"},{"$f":"VLOOKUP(N29,Year_Three[],3)","v":"Drill"},{"$f":"VLOOKUP(O29,Year_Three[],3)","v":"IT"},{"$f":"VLOOKUP(P29,Year_Three[],3)","v":"Physical Activities"},{"$f":"VLOOKUP(Q29,Year_Three[],3)","v":"No Training"},{"$f":"VLOOKUP(R29,Year_Three[],3)","v":"No Training"},{"$f":"VLOOKUP(S29,Year_Three[],3)","v":"No Training"},{"$f":"VLOOKUP(T29,Year_Three[],3)","v":"IT"},{"$f":"VLOOKUP(U29,Year_Three[],3)","v":"IT"},{"$f":"VLOOKUP(V29,Year_Three[],3)","v":"Sports"},{"$f":"VLOOKUP(W29,Year_Three[],3)","v":"IT"},{"$f":"VLOOKUP(X29,Year_Three[],3)","v":"Leadership"},{"$f":"VLOOKUP(Y29,Year_Three[],3)","v":"IT"},{"$f":"VLOOKUP(Z29,Year_Three[],3)","v":"Physical Activities"},{"$f":"VLOOKUP(AA29,Year_Three[],3)","v":{"v":0,"d":"0.00"}},{"$f":"VLOOKUP(AB29,Year_Three[],3)","v":"Physical Activities"},{"$f":"VLOOKUP(AC29,Year_Three[],3)","v":{"v":0,"d":"0.00"}},{"$f":"VLOOKUP(AD29,Year_Three[],3)","v":"No Training"},{"$f":"VLOOKUP(AE29,Year_Three[],3)","v":"CO's Parade"},{"$f":"VLOOKUP(AF29,Year_Three[],3)","v":"Navigation"},{"$f":"VLOOKUP(AG29,Year_Three[],3)","v":"Navigation"},{"$f":"VLOOKUP(AH29,Year_Three[],3)","v":"Navigation"},{"$f":"VLOOKUP(AI29,Year_Three[],3)","v":"Outdoor Leadership"},{"$f":"VLOOKUP(AJ29,Year_Three[],3)","v":"Expedition"},{"$f":"VLOOKUP(AK29,Year_Three[],3)","v":"Expedition"},{"$f":"VLOOKUP(AL29,Year_Three[],3)","v":"Wilderness Survival"},{"$f":"VLOOKUP(AM29,Year_Three[],3)","v":"Drill"},{"$f":"VLOOKUP(AN29,Year_Three[],3)","v":"Drill"},{"$f":"VLOOKUP(AO29,Year_Three[],3)","v":"Drill"},{"$f":"VLOOKUP(AP29,Year_Three[],3)","v":{"$error":"#N/A"}},{"$f":"VLOOKUP(AQ29,Year_Three[],3)","v":{"$error":"#N/A"}},{"$f":"VLOOKUP(AR29,Year_Three[],3)","v":{"$error":"#N/A"}},{"$f":"VLOOKUP(AS29,Year_Three[],3)","v":{"$error":"#N/A"}},{"$f":"VLOOKUP(AT29,Year_Three[],3)","v":{"$error":"#N/A"}},{"$f":"VLOOKUP(AU29,Year_Three[],3)","v":{"$error":"#N/A"}},{"$f":"VLOOKUP(AV29,Year_Three[],3)","v":{"$error":"#N/A"}}]
[null,null,"Instructor",{"$f":"VLOOKUP(D29,Year_Three[],4)","v":{"v":0,"d":"0.00"}},{"$f":"VLOOKUP(E29,Year_Three[],4)","v":{"v":0,"d":"0.00"}},{"$f":"VLOOKUP(F29,Year_Three[],4)","v":{"v":0,"d":"0.00"}},{"$f":"VLOOKUP(G29,Year_Three[],4)","v":{"v":0,"d":"0.00"}},{"$f":"VLOOKUP(H29,Year_Three[],4)","v":{"v":0,"d":"0.00"}},{"$f":"VLOOKUP(I29,Year_Three[],4)","v":{"v":0,"d":"0.00"}},{"$f":"VLOOKUP(J29,Year_Three[],4)","v":{"v":0,"d":"0.00"}},{"$f":"VLOOKUP(K29,Year_Three[],4)","v":{"v":0,"d":"0.00"}},{"$f":"VLOOKUP(L29,Year_Three[],4)","v":{"v":0,"d":"0.00"}},{"$f":"VLOOKUP(M29,Year_Three[],4)","v":{"v":0,"d":"0.00"}},{"$f":"VLOOKUP(N29,Year_Three[],4)","v":{"v":0,"d":"0.00"}},{"$f":"VLOOKUP(O29,Year_Three[],4)","v":{"v":0,"d":"0.00"}},{"$f":"VLOOKUP(P29,Year_Three[],4)","v":{"v":0,"d":"0.00"}},{"$f":"VLOOKUP(Q29,Year_Three[],4)","v":{"v":0,"d":"0.00"}},{"$f":"VLOOKUP(R29,Year_Three[],4)","v":{"v":0,"d":"0.00"}},{"$f":"VLOOKUP(S29,Year_Three[],4)","v":{"v":0,"d":"0.00"}},{"$f":"VLOOKUP(T29,Year_Three[],4)","v":{"v":0,"d":"0.00"}},{"$f":"VLOOKUP(U29,Year_Three[],4)","v":{"v":0,"d":"0.00"}},{"$f":"VLOOKUP(V29,Year_Three[],4)","v":{"v":0,"d":"0.00"}},{"$f":"VLOOKUP(W29,Year_Three[],4)","v":{"v":0,"d":"0.00"}},{"$f":"VLOOKUP(X29,Year_Three[],4)","v":{"v":0,"d":"0.00"}},{"$f":"VLOOKUP(Y29,Year_Three[],4)","v":{"v":0,"d":"0.00"}},{"$f":"VLOOKUP(Z29,Year_Three[],4)","v":{"v":0,"d":"0.00"}},{"$f":"VLOOKUP(AA29,Year_Three[],4)","v":{"v":0,"d":"0.00"}},{"$f":"VLOOKUP(AB29,Year_Three[],4)","v":{"v":0,"d":"0.00"}},{"$f":"VLOOKUP(AC29,Year_Three[],4)","v":{"v":0,"d":"0.00"}},{"$f":"VLOOKUP(AD29,Year_Three[],4)","v":{"v":0,"d":"0.00"}},{"$f":"VLOOKUP(AE29,Year_Three[],4)","v":"CO"},{"$f":"VLOOKUP(AF29,Year_Three[],4)","v":"WO Mallon"},{"$f":"VLOOKUP(AG29,Year_Three[],4)","v":{"v":0,"d":"0.00"}},{"$f":"VLOOKUP(AH29,Year_Three[],4)","v":{"v":0,"d":"0.00"}},{"$f":"VLOOKUP(AI29,Year_Three[],4)","v":{"v":0,"d":"0.00"}},{"$f":"VLOOKUP(AJ29,Year_Three[],4)","v":{"v":0,"d":"0.00"}},{"$f":"VLOOKUP(AK29,Year_Three[],4)","v":{"v":0,"d":"0.00"}},{"$f":"VLOOKUP(AL29,Year_Three[],4)","v":{"v":0,"d":"0.00"}},{"$f":"VLOOKUP(AM29,Year_Three[],4)","v":{"v":0,"d":"0.00"}},{"$f":"VLOOKUP(AN29,Year_Three[],4)","v":{"v":0,"d":"0.00"}},{"$f":"VLOOKUP(AO29,Year_Three[],4)","v":{"v":0,"d":"0.00"}},{"$f":"VLOOKUP(AP29,Year_Three[],4)","v":{"$error":"#N/A"}},{"$f":"VLOOKUP(AQ29,Year_Three[],4)","v":{"$error":"#N/A"}},{"$f":"VLOOKUP(AR29,Year_Three[],4)","v":{"$error":"#N/A"}},{"$f":"VLOOKUP(AS29,Year_Three[],4)","v":{"$error":"#N/A"}},{"$f":"VLOOKUP(AT29,Year_Three[],4)","v":{"$error":"#N/A"}},{"$f":"VLOOKUP(AU29,Year_Three[],4)","v":{"$error":"#N/A"}},{"$f":"VLOOKUP(AV29,Year_Three[],4)","v":{"$error":"#N/A"}}]
[null,null,"Location",{"$f":"VLOOKUP(D29,Year_Three[],5)","v":{"v":0,"d":"0.00"}},{"$f":"VLOOKUP(E29,Year_Three[],5)","v":{"v":0,"d":"0.00"}},{"$f":"VLOOKUP(F29,Year_Three[],5)","v":{"v":0,"d":"0.00"}},{"$f":"VLOOKUP(G29,Year_Three[],5)","v":{"v":0,"d":"0.00"}},{"$f":"VLOOKUP(H29,Year_Three[],5)","v":{"v":0,"d":"0.00"}},{"$f":"VLOOKUP(I29,Year_Three[],5)","v":{"v":0,"d":"0.00"}},{"$f":"VLOOKUP(J29,Year_Three[],5)","v":{"v":0,"d":"0.00"}},{"$f":"VLOOKUP(K29,Year_Three[],5)","v":{"v":0,"d":"0.00"}},{"$f":"VLOOKUP(L29,Year_Three[],5)","v":{"v":0,"d":"0.00"}},{"$f":"VLOOKUP(M29,Year_Three[],5)","v":{"v":0,"d":"0.00"}},{"$f":"VLOOKUP(N29,Year_Three[],5)","v":{"v":0,"d":"0.00"}},{"$f":"VLOOKUP(O29,Year_Three[],5)","v":{"v":0,"d":"0.00"}},{"$f":"VLOOKUP(P29,Year_Three[],5)","v":{"v":0,"d":"0.00"}},{"$f":"VLOOKUP(Q29,Year_Three[],5)","v":{"v":0,"d":"0.00"}},{"$f":"VLOOKUP(R29,Year_Three[],5)","v":{"v":0,"d":"0.00"}},{"$f":"VLOOKUP(S29,Year_Three[],5)","v":{"v":0,"d":"0.00"}},{"$f":"VLOOKUP(T29,Year_Three[],5)","v":{"v":0,"d":"0.00"}},{"$f":"VLOOKUP(U29,Year_Three[],5)","v":{"v":0,"d":"0.00"}},{"$f":"VLOOKUP(V29,Year_Three[],5)","v":{"v":0,"d":"0.00"}},{"$f":"VLOOKUP(W29,Year_Three[],5)","v":{"v":0,"d":"0.00"}},{"$f":"VLOOKUP(X29,Year_Three[],5)","v":{"v":0,"d":"0.00"}},{"$f":"VLOOKUP(Y29,Year_Three[],5)","v":{"v":0,"d":"0.00"}},{"$f":"VLOOKUP(Z29,Year_Three[],5)","v":{"v":0,"d":"0.00"}},{"$f":"VLOOKUP(AA29,Year_Three[],5)","v":{"v":0,"d":"0.00"}},{"$f":"VLOOKUP(AB29,Year_Three[],5)","v":{"v":0,"d":"0.00"}},{"$f":"VLOOKUP(AC29,Year_Three[],5)","v":{"v":0,"d":"0.00"}},{"$f":"VLOOKUP(AD29,Year_Three[],5)","v":{"v":0,"d":"0.00"}},{"$f":"VLOOKUP(AE29,Year_Three[],5)","v":"Parking Lot"},{"$f":"VLOOKUP(AF29,Year_Three[],5)","v":"Green Star Rm (B)"},{"$f":"VLOOKUP(AG29,Year_Three[],5)","v":{"v":0,"d":"0.00"}},{"$f":"VLOOKUP(AH29,Year_Three[],5)","v":{"v":0,"d":"0.00"}},{"$f":"VLOOKUP(AI29,Year_Three[],5)","v":{"v":0,"d":"0.00"}},{"$f":"VLOOKUP(AJ29,Year_Three[],5)","v":{"v":0,"d":"0.00"}},{"$f":"VLOOKUP(AK29,Year_Three[],5)","v":{"v":0,"d":"0.00"}},{"$f":"VLOOKUP(AL29,Year_Three[],5)","v":{"v":0,"d":"0.00"}},{"$f":"VLOOKUP(AM29,Year_Three[],5)","v":{"v":0,"d":"0.00"}},{"$f":"VLOOKUP(AN29,Year_Three[],5)","v":{"v":0,"d":"0.00"}},{"$f":"VLOOKUP(AO29,Year_Three[],5)","v":{"v":0,"d":"0.00"}},{"$f":"VLOOKUP(AP29,Year_Three[],5)","v":{"$error":"#N/A"}},{"$f":"VLOOKUP(AQ29,Year_Three[],5)","v":{"$error":"#N/A"}},{"$f":"VLOOKUP(AR29,Year_Three[],5)","v":{"$error":"#N/A"}},{"$f":"VLOOKUP(AS29,Year_Three[],5)","v":{"$error":"#N/A"}},{"$f":"VLOOKUP(AT29,Year_Three[],5)","v":{"$error":"#N/A"}},{"$f":"VLOOKUP(AU29,Year_Three[],5)","v":{"$error":"#N/A"}},{"$f":"VLOOKUP(AV29,Year_Three[],5)","v":{"$error":"#N/A"}}]
[null,2,"PO/EO No.",{"$f":"'Master PO Schedule'!D9","v":"Admin"},{"$f":"'Master PO Schedule'!E9","v":"MX01.01B"},{"$f":"'Master PO Schedule'!F9","v":"CX05.01"},{"$f":"'Master PO Schedule'!G9","v":"M303.02"},{"$f":"'Master PO Schedule'!H9","v":"M326.01"},{"$f":"'Master PO Schedule'!I9","v":"M324.01"},{"$f":"'Master PO Schedule'!J9","v":"M303.04"},{"$f":"'Master PO Schedule'!K9","v":"M309.06"},{"$f":"'Master PO Schedule'!L9","v":"C308.01"},{"$f":"'Master PO Schedule'!M9","v":"C208.02"},{"$f":"'Master PO Schedule'!N9","v":"M303.06"},{"$f":"'Master PO Schedule'!O9","v":"M303.06"},{"$f":"'Master PO Schedule'!P9","v":"CX05.01"},{"$f":"'Master PO Schedule'!Q9","v":"Christmas"},{"$f":"'Master PO Schedule'!R9","v":"Christmas"},{"$f":"'Master PO Schedule'!S9","v":"Christmas"},{"$f":"'Master PO Schedule'!T9","v":"M303.06"},{"$f":"'Master PO Schedule'!U9","v":"M303.06"},{"$f":"'Master PO Schedule'!V9","v":"Stand Down"},{"$f":"'Master PO Schedule'!W9","v":"M303.06"},{"$f":"'Master PO Schedule'!X9","v":"MX20.01A"},{"$f":"'Master PO Schedule'!Y9","v":"C309.06"},{"$f":"'Master PO Schedule'!Z9","v":"CX05.01"},{"$f":"'Master PO Schedule'!AA9","v":"Optional IT"},{"$f":"'Master PO Schedule'!AB9","v":"CX05.01"},{"$f":"'Master PO Schedule'!AC9","v":"Optional IT"},{"$f":"'Master PO Schedule'!AD9","v":"March Break"},{"$f":"'Master PO Schedule'!AE9","v":"M322.01"},{"$f":"'Master PO Schedule'!AF9","v":"M322.02"},{"$f":"'Master PO Schedule'!AG9","v":"M322.05"},{"$f":"'Master PO Schedule'!AH9","v":"C322.02"},{"$f":"'Master PO Schedule'!AI9","v":"M325.03"},{"$f":"'Master PO Schedule'!AJ9","v":"M326.03"},{"$f":"'Master PO Schedule'!AK9","v":"M326.03"},{"$f":"'Master PO Schedule'!AL9","v":"M324.02"},{"$f":"'Master PO Schedule'!AM9","v":"M308.01"},{"$f":"'Master PO Schedule'!AN9","v":"M308.01"},{"$f":"'Master PO Schedule'!AO9","v":"M308.01"},{"$f":"'Master PO Schedule'!AP9","v":{"v":0,"d":"0.00"}},{"$f":"'Master PO Schedule'!AQ9","v":{"v":0,"d":"0.00"}},{"$f":"'Master PO Schedule'!AR9","v":{"v":0,"d":"0.00"}},{"$f":"'Master PO Schedule'!AS9","v":{"v":0,"d":"0.00"}},{"$f":"'Master PO Schedule'!AT9","v":{"v":0,"d":"0.00"}},{"$f":"'Master PO Schedule'!AU9","v":{"v":0,"d":"0.00"}},{"$f":"'Master PO Schedule'!AV9","v":{"v":0,"d":"0.00"}}]
[null,null,"PO Title",{"$f":"VLOOKUP(D33,Year_Three[],3)","v":"Annual Review"},{"$f":"VLOOKUP(E33,Year_Three[],3)","v":"Citizenship"},{"$f":"VLOOKUP(F33,Year_Three[],3)","v":"Physical Activities"},{"$f":"VLOOKUP(G33,Year_Three[],3)","v":"Leadership"},{"$f":"VLOOKUP(H33,Year_Three[],3)","v":"Expedition"},{"$f":"VLOOKUP(I33,Year_Three[],3)","v":"Wilderness Survival"},{"$f":"VLOOKUP(J33,Year_Three[],3)","v":"Leadership"},{"$f":"VLOOKUP(K33,Year_Three[],3)","v":"IT"},{"$f":"VLOOKUP(L33,Year_Three[],3)","v":"Drill"},{"$f":"VLOOKUP(M33,Year_Three[],3)","v":"Drill"},{"$f":"VLOOKUP(N33,Year_Three[],3)","v":"Leadership"},{"$f":"VLOOKUP(O33,Year_Three[],3)","v":"Leadership"},{"$f":"VLOOKUP(P33,Year_Three[],3)","v":"Physical Activities"},{"$f":"VLOOKUP(Q33,Year_Three[],3)","v":"No Training"},{"$f":"VLOOKUP(R33,Year_Three[],3)","v":"No Training"},{"$f":"VLOOKUP(S33,Year_Three[],3)","v":"No Training"},{"$f":"VLOOKUP(T33,Year_Three[],3)","v":"Leadership"},{"$f":"VLOOKUP(U33,Year_Three[],3)","v":"Leadership"},{"$f":"VLOOKUP(V33,Year_Three[],3)","v":"Sports"},{"$f":"VLOOKUP(W33,Year_Three[],3)","v":"Leadership"},{"$f":"VLOOKUP(X33,Year_Three[],3)","v":"CAF Famil"},{"$f":"VLOOKUP(Y33,Year_Three[],3)","v":"IT"},{"$f":"VLOOKUP(Z33,Year_Three[],3)","v":"Physical Activities"},{"$f":"VLOOKUP(AA33,Year_Three[],3)","v":{"v":0,"d":"0.00"}},{"$f":"VLOOKUP(AB33,Year_Three[],3)","v":"Physical Activities"},{"$f":"VLOOKUP(AC33,Year_Three[],3)","v":{"v":0,"d":"0.00"}},{"$f":"VLOOKUP(AD33,Year_Three[],3)","v":"No Training"},{"$f":"VLOOKUP(AE33,Year_Three[],3)","v":"Navigation"},{"$f":"VLOOKUP(AF33,Year_Three[],3)","v":"Navigation"},{"$f":"VLOOKUP(AG33,Year_Three[],3)","v":"Navigation"},{"$f":"VLOOKUP(AH33,Year_Three[],3)","v":"Navigation"},{"$f":"VLOOKUP(AI33,Year_Three[],3)","v":"Outdoor Leadership"},{"$f":"VLOOKUP(AJ33,Year_Three[],3)","v":"Expedition"},{"$f":"VLOOKUP(AK33,Year_Three[],3)","v":"Expedition"},{"$f":"VLOOKUP(AL33,Year_Three[],3)","v":"Wilderness Survival"},{"$f":"VLOOKUP(AM33,Year_Three[],3)","v":"Drill"},{"$f":"VLOOKUP(AN33,Year_Three[],3)","v":"Drill"},{"$f":"VLOOKUP(AO33,Year_Three[],3)","v":"Drill"},{"$f":"VLOOKUP(AP33,Year_Three[],3)","v":{"$error":"#N/A"}},{"$f":"VLOOKUP(AQ33,Year_Three[],3)","v":{"$error":"#N/A"}},{"$f":"VLOOKUP(AR33,Year_Three[],3)","v":{"$error":"#N/A"}},{"$f":"VLOOKUP(AS33,Year_Three[],3)","v":{"$error":"#N/A"}},{"$f":"VLOOKUP(AT33,Year_Three[],3)","v":{"$error":"#N/A"}},{"$f":"VLOOKUP(AU33,Year_Three[],3)","v":{"$error":"#N/A"}},{"$f":"VLOOKUP(AV33,Year_Three[],3)","v":{"$error":"#N/A"}}]
[null,null,"Instructor",{"$f":"VLOOKUP(D33,Year_Three[],4)","v":0},{"$f":"VLOOKUP(E33,Year_Three[],4)","v":0},{"$f":"VLOOKUP(F33,Year_Three[],4)","v":0},{"$f":"VLOOKUP(G33,Year_Three[],4)","v":0},{"$f":"VLOOKUP(H33,Year_Three[],4)","v":0},{"$f":"VLOOKUP(I33,Year_Three[],4)","v":0},{"$f":"VLOOKUP(J33,Year_Three[],4)","v":0},{"$f":"VLOOKUP(K33,Year_Three[],4)","v":0},{"$f":"VLOOKUP(L33,Year_Three[],4)","v":0},{"$f":"VLOOKUP(M33,Year_Three[],4)","v":0},{"$f":"VLOOKUP(N33,Year_Three[],4)","v":0},{"$f":"VLOOKUP(O33,Year_Three[],4)","v":0},{"$f":"VLOOKUP(P33,Year_Three[],4)","v":0},{"$f":"VLOOKUP(Q33,Year_Three[],4)","v":0},{"$f":"VLOOKUP(R33,Year_Three[],4)","v":0},{"$f":"VLOOKUP(S33,Year_Three[],4)","v":0},{"$f":"VLOOKUP(T33,Year_Three[],4)","v":0},{"$f":"VLOOKUP(U33,Year_Three[],4)","v":0},{"$f":"VLOOKUP(V33,Year_Three[],4)","v":0},{"$f":"VLOOKUP(W33,Year_Three[],4)","v":0},{"$f":"VLOOKUP(X33,Year_Three[],4)","v":0},{"$f":"VLOOKUP(Y33,Year_Three[],4)","v":0},{"$f":"VLOOKUP(Z33,Year_Three[],4)","v":0},{"$f":"VLOOKUP(AA33,Year_Three[],4)","v":0},{"$f":"VLOOKUP(AB33,Year_Three[],4)","v":0},{"$f":"VLOOKUP(AC33,Year_Three[],4)","v":0},{"$f":"VLOOKUP(AD33,Year_Three[],4)","v":0},{"$f":"VLOOKUP(AE33,Year_Three[],4)","v":"WO Mallon"},{"$f":"VLOOKUP(AF33,Year_Three[],4)","v":"WO Mallon"},{"$f":"VLOOKUP(AG33,Year_Three[],4)","v":0},{"$f":"VLOOKUP(AH33,Year_Three[],4)","v":0},{"$f":"VLOOKUP(AI33,Year_Three[],4)","v":0},{"$f":"VLOOKUP(AJ33,Year_Three[],4)","v":0},{"$f":"VLOOKUP(AK33,Year_Three[],4)","v":0},{"$f":"VLOOKUP(AL33,Year_Three[],4)","v":0},{"$f":"VLOOKUP(AM33,Year_Three[],4)","v":0},{"$f":"VLOOKUP(AN33,Year_Three[],4)","v":0},{"$f":"VLOOKUP(AO33,Year_Three[],4)","v":0},{"$f":"VLOOKUP(AP33,Year_Three[],4)","v":{"$error":"#N/A"}},{"$f":"VLOOKUP(AQ33,Year_Three[],4)","v":{"$error":"#N/A"}},{"$f":"VLOOKUP(AR33,Year_Three[],4)","v":{"$error":"#N/A"}},{"$f":"VLOOKUP(AS33,Year_Three[],4)","v":{"$error":"#N/A"}},{"$f":"VLOOKUP(AT33,Year_Three[],4)","v":{"$error":"#N/A"}},{"$f":"VLOOKUP(AU33,Year_Three[],4)","v":{"$error":"#N/A"}},{"$f":"VLOOKUP(AV33,Year_Three[],4)","v":{"$error":"#N/A"}}]
[null,null,"Location",{"$f":"VLOOKUP(D33,Year_Three[],5)","v":0},{"$f":"VLOOKUP(E33,Year_Three[],5)","v":0},{"$f":"VLOOKUP(F33,Year_Three[],5)","v":0},{"$f":"VLOOKUP(G33,Year_Three[],5)","v":0},{"$f":"VLOOKUP(H33,Year_Three[],5)","v":0},{"$f":"VLOOKUP(I33,Year_Three[],5)","v":0},{"$f":"VLOOKUP(J33,Year_Three[],5)","v":0},{"$f":"VLOOKUP(K33,Year_Three[],5)","v":0},{"$f":"VLOOKUP(L33,Year_Three[],5)","v":0},{"$f":"VLOOKUP(M33,Year_Three[],5)","v":0},{"$f":"VLOOKUP(N33,Year_Three[],5)","v":0},{"$f":"VLOOKUP(O33,Year_Three[],5)","v":0},{"$f":"VLOOKUP(P33,Year_Three[],5)","v":0},{"$f":"VLOOKUP(Q33,Year_Three[],5)","v":0},{"$f":"VLOOKUP(R33,Year_Three[],5)","v":0},{"$f":"VLOOKUP(S33,Year_Three[],5)","v":0},{"$f":"VLOOKUP(T33,Year_Three[],5)","v":0},{"$f":"VLOOKUP(U33,Year_Three[],5)","v":0},{"$f":"VLOOKUP(V33,Year_Three[],5)","v":0},{"$f":"VLOOKUP(W33,Year_Three[],5)","v":0},{"$f":"VLOOKUP(X33,Year_Three[],5)","v":0},{"$f":"VLOOKUP(Y33,Year_Three[],5)","v":0},{"$f":"VLOOKUP(Z33,Year_Three[],5)","v":0},{"$f":"VLOOKUP(AA33,Year_Three[],5)","v":0},{"$f":"VLOOKUP(AB33,Year_Three[],5)","v":0},{"$f":"VLOOKUP(AC33,Year_Three[],5)","v":0},{"$f":"VLOOKUP(AD33,Year_Three[],5)","v":0},{"$f":"VLOOKUP(AE33,Year_Three[],5)","v":"Green Star Rm (B)"},{"$f":"VLOOKUP(AF33,Year_Three[],5)","v":"Green Star Rm (B)"},{"$f":"VLOOKUP(AG33,Year_Three[],5)","v":0},{"$f":"VLOOKUP(AH33,Year_Three[],5)","v":0},{"$f":"VLOOKUP(AI33,Year_Three[],5)","v":0},{"$f":"VLOOKUP(AJ33,Year_Three[],5)","v":0},{"$f":"VLOOKUP(AK33,Year_Three[],5)","v":0},{"$f":"VLOOKUP(AL33,Year_Three[],5)","v":0},{"$f":"VLOOKUP(AM33,Year_Three[],5)","v":0},{"$f":"VLOOKUP(AN33,Year_Three[],5)","v":0},{"$f":"VLOOKUP(AO33,Year_Three[],5)","v":0},{"$f":"VLOOKUP(AP33,Year_Three[],5)","v":{"$error":"#N/A"}},{"$f":"VLOOKUP(AQ33,Year_Three[],5)","v":{"$error":"#N/A"}},{"$f":"VLOOKUP(AR33,Year_Three[],5)","v":{"$error":"#N/A"}},{"$f":"VLOOKUP(AS33,Year_Three[],5)","v":{"$error":"#N/A"}},{"$f":"VLOOKUP(AT33,Year_Three[],5)","v":{"$error":"#N/A"}},{"$f":"VLOOKUP(AU33,Year_Three[],5)","v":{"$error":"#N/A"}},{"$f":"VLOOKUP(AV33,Year_Three[],5)","v":{"$error":"#N/A"}}]
[null,3,"PO/EO No.",{"$f":"'Master PO Schedule'!D10","v":"Admin"},{"$f":"'Master PO Schedule'!E10","v":"MX01.01C"},{"$f":"'Master PO Schedule'!F10","v":"CX05.01"},{"$f":"'Master PO Schedule'!G10","v":"M303.03"},{"$f":"'Master PO Schedule'!H10","v":"M326.02"},{"$f":"'Master PO Schedule'!I10","v":"M324.02"},{"$f":"'Master PO Schedule'!J10","v":"M303.05"},{"$f":"'Master PO Schedule'!K10","v":"M309.07"},{"$f":"'Master PO Schedule'!L10","v":"C308.02"},{"$f":"'Master PO Schedule'!M10","v":"C309.06"},{"$f":"'Master PO Schedule'!N10","v":"M303.07"},{"$f":"'Master PO Schedule'!O10","v":"M303.07"},{"$f":"'Master PO Schedule'!P10","v":"CX05.01"},{"$f":"'Master PO Schedule'!Q10","v":"Christmas"},{"$f":"'Master PO Schedule'!R10","v":"Christmas"},{"$f":"'Master PO Schedule'!S10","v":"Christmas"},{"$f":"'Master PO Schedule'!T10","v":"M303.07"},{"$f":"'Master PO Schedule'!U10","v":"M303.07"},{"$f":"'Master PO Schedule'!V10","v":"Stand Down"},{"$f":"'Master PO Schedule'!W10","v":"M303.07"},{"$f":"'Master PO Schedule'!X10","v":"MX20.01B"},{"$f":"'Master PO Schedule'!Y10","v":"C325.01"},{"$f":"'Master PO Schedule'!Z10","v":"CX05.01"},{"$f":"'Master PO Schedule'!AA10","v":"M306.01"},{"$f":"'Master PO Schedule'!AB10","v":"CX05.01"},{"$f":"'Master PO Schedule'!AC10","v":"M306.01"},{"$f":"'Master PO Schedule'!AD10","v":"March Break"},{"$f":"'Master PO Schedule'!AE10","v":"M322.02"},{"$f":"'Master PO Schedule'!AF10","v":"M322.03"},{"$f":"'Master PO Schedule'!AG10","v":"M322.06"},{"$f":"'Master PO Schedule'!AH10","v":"M325.01"},{"$f":"'Master PO Schedule'!AI10","v":"M326.01"},{"$f":"'Master PO Schedule'!AJ10","v":"M326.04"},{"$f":"'Master PO Schedule'!AK10","v":"M326.04"},{"$f":"'Master PO Schedule'!AL10","v":"M324.03"},{"$f":"'Master PO Schedule'!AM10","v":"M308.01"},{"$f":"'Master PO Schedule'!AN10","v":"M308.01"},{"$f":"'Master PO Schedule'!AO10","v":"M308.01"},{"$f":"'Master PO Schedule'!AP10","v":{"v":0,"d":"0.00"}},{"$f":"'Master PO Schedule'!AQ10","v":{"v":0,"d":"0.00"}},{"$f":"'Master PO Schedule'!AR10","v":{"v":0,"d":"0.00"}},{"$f":"'Master PO Schedule'!AS10","v":{"v":0,"d":"0.00"}},{"$f":"'Master PO Schedule'!AT10","v":{"v":0,"d":"0.00"}},{"$f":"'Master PO Schedule'!AU10","v":{"v":0,"d":"0.00"}},{"$f":"'Master PO Schedule'!AV10","v":{"v":0,"d":"0.00"}}]
[null,null,"PO Title",{"$f":"VLOOKUP(D37,Year_Three[],3)","v":"Annual Review"},{"$f":"VLOOKUP(E37,Year_Three[],3)","v":"Citizenship"},{"$f":"VLOOKUP(F37,Year_Three[],3)","v":"Physical Activities"},{"$f":"VLOOKUP(G37,Year_Three[],3)","v":"Leadership"},{"$f":"VLOOKUP(H37,Year_Three[],3)","v":"Expedition"},{"$f":"VLOOKUP(I37,Year_Three[],3)","v":"Wilderness Survival"},{"$f":"VLOOKUP(J37,Year_Three[],3)","v":"Leadership"},{"$f":"VLOOKUP(K37,Year_Three[],3)","v":"IT"},{"$f":"VLOOKUP(L37,Year_Three[],3)","v":"Drill"},{"$f":"VLOOKUP(M37,Year_Three[],3)","v":"IT"},{"$f":"VLOOKUP(N37,Year_Three[],3)","v":"Leadership"},{"$f":"VLOOKUP(O37,Year_Three[],3)","v":"Leadership"},{"$f":"VLOOKUP(P37,Year_Three[],3)","v":"Physical Activities"},{"$f":"VLOOKUP(Q37,Year_Three[],3)","v":"No Training"},{"$f":"VLOOKUP(R37,Year_Three[],3)","v":"No Training"},{"$f":"VLOOKUP(S37,Year_Three[],3)","v":"No Training"},{"$f":"VLOOKUP(T37,Year_Three[],3)","v":"Leadership"},{"$f":"VLOOKUP(U37,Year_Three[],3)","v":"Leadership"},{"$f":"VLOOKUP(V37,Year_Three[],3)","v":"Sports"},{"$f":"VLOOKUP(W37,Year_Three[],3)","v":"Leadership"},{"$f":"VLOOKUP(X37,Year_Three[],3)","v":"CAF Famil"},{"$f":"VLOOKUP(Y37,Year_Three[],3)","v":"Outdoor Leadership"},{"$f":"VLOOKUP(Z37,Year_Three[],3)","v":"Physical Activities"},{"$f":"VLOOKUP(AA37,Year_Three[],3)","v":"Marksmanship"},{"$f":"VLOOKUP(AB37,Year_Three[],3)","v":"Physical Activities"},{"$f":"VLOOKUP(AC37,Year_Three[],3)","v":"Marksmanship"},{"$f":"VLOOKUP(AD37,Year_Three[],3)","v":"No Training"},{"$f":"VLOOKUP(AE37,Year_Three[],3)","v":"Navigation"},{"$f":"VLOOKUP(AF37,Year_Three[],3)","v":"Navigation"},{"$f":"VLOOKUP(AG37,Year_Three[],3)","v":"Navigation"},{"$f":"VLOOKUP(AH37,Year_Three[],3)","v":"Outdoor Leadership"},{"$f":"VLOOKUP(AI37,Year_Three[],3)","v":"Expedition"},{"$f":"VLOOKUP(AJ37,Year_Three[],3)","v":"Expedition"},{"$f":"VLOOKUP(AK37,Year_Three[],3)","v":"Expedition"},{"$f":"VLOOKUP(AL37,Year_Three[],3)","v":"Wilderness Survival"},{"$f":"VLOOKUP(AM37,Year_Three[],3)","v":"Drill"},{"$f":"VLOOKUP(AN37,Year_Three[],3)","v":"Drill"},{"$f":"VLOOKUP(AO37,Year_Three[],3)","v":"Drill"},{"$f":"VLOOKUP(AP37,Year_Three[],3)","v":{"$error":"#N/A"}},{"$f":"VLOOKUP(AQ37,Year_Three[],3)","v":{"$error":"#N/A"}},{"$f":"VLOOKUP(AR37,Year_Three[],3)","v":{"$error":"#N/A"}},{"$f":"VLOOKUP(AS37,Year_Three[],3)","v":{"$error":"#N/A"}},{"$f":"VLOOKUP(AT37,Year_Three[],3)","v":{"$error":"#N/A"}},{"$f":"VLOOKUP(AU37,Year_Three[],3)","v":{"$error":"#N/A"}},{"$f":"VLOOKUP(AV37,Year_Three[],3)","v":{"$error":"#N/A"}}]
[null,null,"Instructor",{"$f":"VLOOKUP(D37,Year_Three[],4)","v":0},{"$f":"VLOOKUP(E37,Year_Three[],4)","v":0},{"$f":"VLOOKUP(F37,Year_Three[],4)","v":0},{"$f":"VLOOKUP(G37,Year_Three[],4)","v":0},{"$f":"VLOOKUP(H37,Year_Three[],4)","v":0},{"$f":"VLOOKUP(I37,Year_Three[],4)","v":0},{"$f":"VLOOKUP(J37,Year_Three[],4)","v":0},{"$f":"VLOOKUP(K37,Year_Three[],4)","v":0},{"$f":"VLOOKUP(L37,Year_Three[],4)","v":0},{"$f":"VLOOKUP(M37,Year_Three[],4)","v":0},{"$f":"VLOOKUP(N37,Year_Three[],4)","v":0},{"$f":"VLOOKUP(O37,Year_Three[],4)","v":0},{"$f":"VLOOKUP(P37,Year_Three[],4)","v":0},{"$f":"VLOOKUP(Q37,Year_Three[],4)","v":0},{"$f":"VLOOKUP(R37,Year_Three[],4)","v":0},{"$f":"VLOOKUP(S37,Year_Three[],4)","v":0},{"$f":"VLOOKUP(T37,Year_Three[],4)","v":0},{"$f":"VLOOKUP(U37,Year_Three[],4)","v":0},{"$f":"VLOOKUP(V37,Year_Three[],4)","v":0},{"$f":"VLOOKUP(W37,Year_Three[],4)","v":0},{"$f":"VLOOKUP(X37,Year_Three[],4)","v":0},{"$f":"VLOOKUP(Y37,Year_Three[],4)","v":0},{"$f":"VLOOKUP(Z37,Year_Three[],4)","v":0},{"$f":"VLOOKUP(AA37,Year_Three[],4)","v":0},{"$f":"VLOOKUP(AB37,Year_Three[],4)","v":0},{"$f":"VLOOKUP(AC37,Year_Three[],4)","v":0},{"$f":"VLOOKUP(AD37,Year_Three[],4)","v":0},{"$f":"VLOOKUP(AE37,Year_Three[],4)","v":"WO Mallon"},{"$f":"VLOOKUP(AF37,Year_Three[],4)","v":0},{"$f":"VLOOKUP(AG37,Year_Three[],4)","v":0},{"$f":"VLOOKUP(AH37,Year_Three[],4)","v":0},{"$f":"VLOOKUP(AI37,Year_Three[],4)","v":0},{"$f":"VLOOKUP(AJ37,Year_Three[],4)","v":0},{"$f":"VLOOKUP(AK37,Year_Three[],4)","v":0},{"$f":"VLOOKUP(AL37,Year_Three[],4)","v":0},{"$f":"VLOOKUP(AM37,Year_Three[],4)","v":0},{"$f":"VLOOKUP(AN37,Year_Three[],4)","v":0},{"$f":"VLOOKUP(AO37,Year_Three[],4)","v":0},{"$f":"VLOOKUP(AP37,Year_Three[],4)","v":{"$error":"#N/A"}},{"$f":"VLOOKUP(AQ37,Year_Three[],4)","v":{"$error":"#N/A"}},{"$f":"VLOOKUP(AR37,Year_Three[],4)","v":{"$error":"#N/A"}},{"$f":"VLOOKUP(AS37,Year_Three[],4)","v":{"$error":"#N/A"}},{"$f":"VLOOKUP(AT37,Year_Three[],4)","v":{"$error":"#N/A"}},{"$f":"VLOOKUP(AU37,Year_Three[],4)","v":{"$error":"#N/A"}},{"$f":"VLOOKUP(AV37,Year_Three[],4)","v":{"$error":"#N/A"}}]
[null,null,"Location",{"$f":"VLOOKUP(D37,Year_Three[],5)","v":0},{"$f":"VLOOKUP(E37,Year_Three[],5)","v":0},{"$f":"VLOOKUP(F37,Year_Three[],5)","v":0},{"$f":"VLOOKUP(G37,Year_Three[],5)","v":0},{"$f":"VLOOKUP(H37,Year_Three[],5)","v":0},{"$f":"VLOOKUP(I37,Year_Three[],5)","v":0},{"$f":"VLOOKUP(J37,Year_Three[],5)","v":0},{"$f":"VLOOKUP(K37,Year_Three[],5)","v":0},{"$f":"VLOOKUP(L37,Year_Three[],5)","v":0},{"$f":"VLOOKUP(M37,Year_Three[],5)","v":0},{"$f":"VLOOKUP(N37,Year_Three[],5)","v":0},{"$f":"VLOOKUP(O37,Year_Three[],5)","v":0},{"$f":"VLOOKUP(P37,Year_Three[],5)","v":0},{"$f":"VLOOKUP(Q37,Year_Three[],5)","v":0},{"$f":"VLOOKUP(R37,Year_Three[],5)","v":0},{"$f":"VLOOKUP(S37,Year_Three[],5)","v":0},{"$f":"VLOOKUP(T37,Year_Three[],5)","v":0},{"$f":"VLOOKUP(U37,Year_Three[],5)","v":0},{"$f":"VLOOKUP(V37,Year_Three[],5)","v":0},{"$f":"VLOOKUP(W37,Year_Three[],5)","v":0},{"$f":"VLOOKUP(X37,Year_Three[],5)","v":0},{"$f":"VLOOKUP(Y37,Year_Three[],5)","v":0},{"$f":"VLOOKUP(Z37,Year_Three[],5)","v":0},{"$f":"VLOOKUP(AA37,Year_Three[],5)","v":0},{"$f":"VLOOKUP(AB37,Year_Three[],5)","v":0},{"$f":"VLOOKUP(AC37,Year_Three[],5)","v":0},{"$f":"VLOOKUP(AD37,Year_Three[],5)","v":0},{"$f":"VLOOKUP(AE37,Year_Three[],5)","v":"Green Star Rm (B)"},{"$f":"VLOOKUP(AF37,Year_Three[],5)","v":0},{"$f":"VLOOKUP(AG37,Year_Three[],5)","v":0},{"$f":"VLOOKUP(AH37,Year_Three[],5)","v":0},{"$f":"VLOOKUP(AI37,Year_Three[],5)","v":0},{"$f":"VLOOKUP(AJ37,Year_Three[],5)","v":0},{"$f":"VLOOKUP(AK37,Year_Three[],5)","v":0},{"$f":"VLOOKUP(AL37,Year_Three[],5)","v":0},{"$f":"VLOOKUP(AM37,Year_Three[],5)","v":0},{"$f":"VLOOKUP(AN37,Year_Three[],5)","v":0},{"$f":"VLOOKUP(AO37,Year_Three[],5)","v":0},{"$f":"VLOOKUP(AP37,Year_Three[],5)","v":{"$error":"#N/A"}},{"$f":"VLOOKUP(AQ37,Year_Three[],5)","v":{"$error":"#N/A"}},{"$f":"VLOOKUP(AR37,Year_Three[],5)","v":{"$error":"#N/A"}},{"$f":"VLOOKUP(AS37,Year_Three[],5)","v":{"$error":"#N/A"}},{"$f":"VLOOKUP(AT37,Year_Three[],5)","v":{"$error":"#N/A"}},{"$f":"VLOOKUP(AU37,Year_Three[],5)","v":{"$error":"#N/A"}},{"$f":"VLOOKUP(AV37,Year_Three[],5)","v":{"$error":"#N/A"}}]
["Gold Star",1,"PO/EO No.",{"$f":"'Master PO Schedule'!D11","v":"Admin"},{"$f":"'Master PO Schedule'!E11","v":"M425.01"},{"$f":"'Master PO Schedule'!F11","v":"CX05.01"},{"$f":"'Master PO Schedule'!G11","v":"C425.01"},{"$f":"'Master PO Schedule'!H11","v":"C424.01"},{"$f":"'Master PO Schedule'!I11","v":"C424.03"},{"$f":"'Master PO Schedule'!J11","v":"M424.01"},{"$f":"'Master PO Schedule'!K11","v":"M408.01"},{"$f":"'Master PO Schedule'!L11","v":"M408.03"},{"$f":"'Master PO Schedule'!M11","v":"C408.01"},{"$f":"'Master PO Schedule'!N11","v":"M409.01"},{"$f":"'Master PO Schedule'!O11","v":"M407.01"},{"$f":"'Master PO Schedule'!P11","v":"CX05.01"},{"$f":"'Master PO Schedule'!Q11","v":"Christmas"},{"$f":"'Master PO Schedule'!R11","v":"Christmas"},{"$f":"'Master PO Schedule'!S11","v":"Christmas"},{"$f":"'Master PO Schedule'!T11","v":"408 PC"},{"$f":"'Master PO Schedule'!U11","v":"408 PC"},{"$f":"'Master PO Schedule'!V11","v":"Stand Down"},{"$f":"'Master PO Schedule'!W11","v":"M407.01"},{"$f":"'Master PO Schedule'!X11","v":"M409.02"},{"$f":"'Master PO Schedule'!Y11","v":"M409.05"},{"$f":"'Master PO Schedule'!Z11","v":"CX05.01"},{"$f":"'Master PO Schedule'!AA11","v":"C422.01"},{"$f":"'Master PO Schedule'!AB11","v":"CX05.01"},{"$f":"'Master PO Schedule'!AC11","v":"C422.01"},{"$f":"'Master PO Schedule'!AD11","v":"March Break"},{"$f":"'Master PO Schedule'!AE11","v":"CO Parade"},{"$f":"'Master PO Schedule'!AF11","v":"M422.01"},{"$f":"'Master PO Schedule'!AG11","v":"C422.01"},{"$f":"'Master PO Schedule'!AH11","v":"M425.01"},{"$f":"'Master PO Schedule'!AI11","v":"C424.01"},{"$f":"'Master PO Schedule'!AJ11","v":"C324.01"},{"$f":"'Master PO Schedule'!AK11","v":"C324.01"},{"$f":"'Master PO Schedule'!AL11","v":"M408.01"},{"$f":"'Master PO Schedule'!AM11","v":"M408.04"},{"$f":"'Master PO Schedule'!AN11","v":"M408.01"},{"$f":"'Master PO Schedule'!AO11","v":"M408.01"},{"$f":"'Master PO Schedule'!AP11","v":{"v":0,"d":"0.00"}},{"$f":"'Master PO Schedule'!AQ11","v":{"v":0,"d":"0.00"}},{"$f":"'Master PO Schedule'!AR11","v":{"v":0,"d":"0.00"}},{"$f":"'Master PO Schedule'!AS11","v":{"v":0,"d":"0.00"}},{"$f":"'Master PO Schedule'!AT11","v":{"v":0,"d":"0.00"}},{"$f":"'Master PO Schedule'!AU11","v":{"v":0,"d":"0.00"}},{"$f":"'Master PO Schedule'!AV11","v":{"v":0,"d":"0.00"}}]
[null,null,"PO Title",{"$f":"VLOOKUP(D41,Year_Four[],3)","v":"Annual Review"},{"$f":"VLOOKUP(E41,Year_Four[],3)","v":"Outdoor Leadership"},{"$f":"VLOOKUP(F41,Year_Four[],3)","v":"Physical Activities"},{"$f":"VLOOKUP(G41,Year_Four[],3)","v":"Outdoor Leadership"},{"$f":"VLOOKUP(H41,Year_Four[],3)","v":"Wilderness Survival"},{"$f":"VLOOKUP(I41,Year_Four[],3)","v":"Wilderness Survival"},{"$f":"VLOOKUP(J41,Year_Four[],3)","v":"Wilderness Survival"},{"$f":"VLOOKUP(K41,Year_Four[],3)","v":"Drill"},{"$f":"VLOOKUP(L41,Year_Four[],3)","v":"Drill"},{"$f":"VLOOKUP(M41,Year_Four[],3)","v":"Drill"},{"$f":"VLOOKUP(N41,Year_Four[],3)","v":"IT"},{"$f":"VLOOKUP(O41,Year_Four[],3)","v":"GCK"},{"$f":"VLOOKUP(P41,Year_Four[],3)","v":"Physical Activities"},{"$f":"VLOOKUP(Q41,Year_Four[],3)","v":"No Training"},{"$f":"VLOOKUP(R41,Year_Four[],3)","v":"No Training"},{"$f":"VLOOKUP(S41,Year_Four[],3)","v":"No Training"},{"$f":"VLOOKUP(T41,Year_Four[],3)","v":"Drill PC"},{"$f":"VLOOKUP(U41,Year_Four[],3)","v":"Drill PC"},{"$f":"VLOOKUP(V41,Year_Four[],3)","v":"Admin"},{"$f":"VLOOKUP(W41,Year_Four[],3)","v":"GCK"},{"$f":"VLOOKUP(X41,Year_Four[],3)","v":"IT"},{"$f":"VLOOKUP(Y41,Year_Four[],3)","v":"IT"},{"$f":"VLOOKUP(Z41,Year_Four[],3)","v":"Physical Activities"},{"$f":"VLOOKUP(AA41,Year_Four[],3)","v":"Navigation"},{"$f":"VLOOKUP(AB41,Year_Four[],3)","v":"Physical Activities"},{"$f":"VLOOKUP(AC41,Year_Four[],3)","v":"Navigation"},{"$f":"VLOOKUP(AD41,Year_Four[],3)","v":"No Training"},{"$f":"VLOOKUP(AE41,Year_Four[],3)","v":"CO's Parade"},{"$f":"VLOOKUP(AF41,Year_Four[],3)","v":"Navigation"},{"$f":"VLOOKUP(AG41,Year_Four[],3)","v":"Navigation"},{"$f":"VLOOKUP(AH41,Year_Four[],3)","v":"Outdoor Leadership"},{"$f":"VLOOKUP(AI41,Year_Four[],3)","v":"Wilderness Survival"},{"$f":"VLOOKUP(AJ41,Year_Four[],3)","v":"Wilderness Survival"},{"$f":"VLOOKUP(AK41,Year_Four[],3)","v":"Wilderness Survival"},{"$f":"VLOOKUP(AL41,Year_Four[],3)","v":"Drill"},{"$f":"VLOOKUP(AM41,Year_Four[],3)","v":"Drill"},{"$f":"VLOOKUP(AN41,Year_Four[],3)","v":"Drill"},{"$f":"VLOOKUP(AO41,Year_Four[],3)","v":"Drill"},{"$f":"VLOOKUP(AP41,Year_Four[],3)","v":{"$error":"#N/A"}},{"$f":"VLOOKUP(AQ41,Year_Four[],3)","v":{"$error":"#N/A"}},{"$f":"VLOOKUP(AR41,Year_Four[],3)","v":{"$error":"#N/A"}},{"$f":"VLOOKUP(AS41,Year_Four[],3)","v":{"$error":"#N/A"}},{"$f":"VLOOKUP(AT41,Year_Four[],3)","v":{"$error":"#N/A"}},{"$f":"VLOOKUP(AU41,Year_Four[],3)","v":{"$error":"#N/A"}},{"$f":"VLOOKUP(AV41,Year_Four[],3)","v":{"$error":"#N/A"}}]
[null,null,"Instructor",{"$f":"VLOOKUP(D41,Year_Four[],4)","v":{"v":0,"d":"0.00"}},{"$f":"VLOOKUP(E41,Year_Four[],4)","v":{"v":0,"d":"0.00"}},{"$f":"VLOOKUP(F41,Year_Four[],4)","v":{"v":0,"d":"0.00"}},{"$f":"VLOOKUP(G41,Year_Four[],4)","v":{"v":0,"d":"0.00"}},{"$f":"VLOOKUP(H41,Year_Four[],4)","v":{"v":0,"d":"0.00"}},{"$f":"VLOOKUP(I41,Year_Four[],4)","v":{"v":0,"d":"0.00"}},{"$f":"VLOOKUP(J41,Year_Four[],4)","v":{"v":0,"d":"0.00"}},{"$f":"VLOOKUP(K41,Year_Four[],4)","v":{"v":0,"d":"0.00"}},{"$f":"VLOOKUP(L41,Year_Four[],4)","v":{"v":0,"d":"0.00"}},{"$f":"VLOOKUP(M41,Year_Four[],4)","v":{"v":0,"d":"0.00"}},{"$f":"VLOOKUP(N41,Year_Four[],4)","v":{"v":0,"d":"0.00"}},{"$f":"VLOOKUP(O41,Year_Four[],4)","v":{"v":0,"d":"0.00"}},{"$f":"VLOOKUP(P41,Year_Four[],4)","v":{"v":0,"d":"0.00"}},{"$f":"VLOOKUP(Q41,Year_Four[],4)","v":{"v":0,"d":"0.00"}},{"$f":"VLOOKUP(R41,Year_Four[],4)","v":{"v":0,"d":"0.00"}},{"$f":"VLOOKUP(S41,Year_Four[],4)","v":{"v":0,"d":"0.00"}},{"$f":"VLOOKUP(T41,Year_Four[],4)","v":{"v":0,"d":"0.00"}},{"$f":"VLOOKUP(U41,Year_Four[],4)","v":{"v":0,"d":"0.00"}},{"$f":"VLOOKUP(V41,Year_Four[],4)","v":{"v":0,"d":"0.00"}},{"$f":"VLOOKUP(W41,Year_Four[],4)","v":{"v":0,"d":"0.00"}},{"$f":"VLOOKUP(X41,Year_Four[],4)","v":{"v":0,"d":"0.00"}},{"$f":"VLOOKUP(Y41,Year_Four[],4)","v":{"v":0,"d":"0.00"}},{"$f":"VLOOKUP(Z41,Year_Four[],4)","v":{"v":0,"d":"0.00"}},{"$f":"VLOOKUP(AA41,Year_Four[],4)","v":{"v":0,"d":"0.00"}},{"$f":"VLOOKUP(AB41,Year_Four[],4)","v":{"v":0,"d":"0.00"}},{"$f":"VLOOKUP(AC41,Year_Four[],4)","v":{"v":0,"d":"0.00"}},{"$f":"VLOOKUP(AD41,Year_Four[],4)","v":{"v":0,"d":"0.00"}},{"$f":"VLOOKUP(AE41,Year_Four[],4)","v":"CO"},{"$f":"VLOOKUP(AF41,Year_Four[],4)","v":"Lt Heaton"},{"$f":"VLOOKUP(AG41,Year_Four[],4)","v":{"v":0,"d":"0.00"}},{"$f":"VLOOKUP(AH41,Year_Four[],4)","v":{"v":0,"d":"0.00"}},{"$f":"VLOOKUP(AI41,Year_Four[],4)","v":{"v":0,"d":"0.00"}},{"$f":"VLOOKUP(AJ41,Year_Four[],4)","v":{"v":0,"d":"0.00"}},{"$f":"VLOOKUP(AK41,Year_Four[],4)","v":{"v":0,"d":"0.00"}},{"$f":"VLOOKUP(AL41,Year_Four[],4)","v":{"v":0,"d":"0.00"}},{"$f":"VLOOKUP(AM41,Year_Four[],4)","v":{"v":0,"d":"0.00"}},{"$f":"VLOOKUP(AN41,Year_Four[],4)","v":{"v":0,"d":"0.00"}},{"$f":"VLOOKUP(AO41,Year_Four[],4)","v":{"v":0,"d":"0.00"}},{"$f":"VLOOKUP(AP41,Year_Four[],4)","v":{"$error":"#N/A"}},{"$f":"VLOOKUP(AQ41,Year_Four[],4)","v":{"$error":"#N/A"}},{"$f":"VLOOKUP(AR41,Year_Four[],4)","v":{"$error":"#N/A"}},{"$f":"VLOOKUP(AS41,Year_Four[],4)","v":{"$error":"#N/A"}},{"$f":"VLOOKUP(AT41,Year_Four[],4)","v":{"$error":"#N/A"}},{"$f":"VLOOKUP(AU41,Year_Four[],4)","v":{"$error":"#N/A"}},{"$f":"VLOOKUP(AV41,Year_Four[],4)","v":{"$error":"#N/A"}}]
[null,null,"Location",{"$f":"VLOOKUP(D41,Year_Four[],5)","v":{"v":0,"d":"0.00"}},{"$f":"VLOOKUP(E41,Year_Four[],5)","v":{"v":0,"d":"0.00"}},{"$f":"VLOOKUP(F41,Year_Four[],5)","v":{"v":0,"d":"0.00"}},{"$f":"VLOOKUP(G41,Year_Four[],5)","v":{"v":0,"d":"0.00"}},{"$f":"VLOOKUP(H41,Year_Four[],5)","v":{"v":0,"d":"0.00"}},{"$f":"VLOOKUP(I41,Year_Four[],5)","v":{"v":0,"d":"0.00"}},{"$f":"VLOOKUP(J41,Year_Four[],5)","v":{"v":0,"d":"0.00"}},{"$f":"VLOOKUP(K41,Year_Four[],5)","v":{"v":0,"d":"0.00"}},{"$f":"VLOOKUP(L41,Year_Four[],5)","v":{"v":0,"d":"0.00"}},{"$f":"VLOOKUP(M41,Year_Four[],5)","v":{"v":0,"d":"0.00"}},{"$f":"VLOOKUP(N41,Year_Four[],5)","v":{"v":0,"d":"0.00"}},{"$f":"VLOOKUP(O41,Year_Four[],5)","v":{"v":0,"d":"0.00"}},{"$f":"VLOOKUP(P41,Year_Four[],5)","v":{"v":0,"d":"0.00"}},{"$f":"VLOOKUP(Q41,Year_Four[],5)","v":{"v":0,"d":"0.00"}},{"$f":"VLOOKUP(R41,Year_Four[],5)","v":{"v":0,"d":"0.00"}},{"$f":"VLOOKUP(S41,Year_Four[],5)","v":{"v":0,"d":"0.00"}},{"$f":"VLOOKUP(T41,Year_Four[],5)","v":{"v":0,"d":"0.00"}},{"$f":"VLOOKUP(U41,Year_Four[],5)","v":{"v":0,"d":"0.00"}},{"$f":"VLOOKUP(V41,Year_Four[],5)","v":{"v":0,"d":"0.00"}},{"$f":"VLOOKUP(W41,Year_Four[],5)","v":{"v":0,"d":"0.00"}},{"$f":"VLOOKUP(X41,Year_Four[],5)","v":{"v":0,"d":"0.00"}},{"$f":"VLOOKUP(Y41,Year_Four[],5)","v":{"v":0,"d":"0.00"}},{"$f":"VLOOKUP(Z41,Year_Four[],5)","v":{"v":0,"d":"0.00"}},{"$f":"VLOOKUP(AA41,Year_Four[],5)","v":{"v":0,"d":"0.00"}},{"$f":"VLOOKUP(AB41,Year_Four[],5)","v":{"v":0,"d":"0.00"}},{"$f":"VLOOKUP(AC41,Year_Four[],5)","v":{"v":0,"d":"0.00"}},{"$f":"VLOOKUP(AD41,Year_Four[],5)","v":{"v":0,"d":"0.00"}},{"$f":"VLOOKUP(AE41,Year_Four[],5)","v":"Parking Lot"},{"$f":"VLOOKUP(AF41,Year_Four[],5)","v":"Upstairs Classroom"},{"$f":"VLOOKUP(AG41,Year_Four[],5)","v":{"v":0,"d":"0.00"}},{"$f":"VLOOKUP(AH41,Year_Four[],5)","v":{"v":0,"d":"0.00"}},{"$f":"VLOOKUP(AI41,Year_Four[],5)","v":{"v":0,"d":"0.00"}},{"$f":"VLOOKUP(AJ41,Year_Four[],5)","v":{"v":0,"d":"0.00"}},{"$f":"VLOOKUP(AK41,Year_Four[],5)","v":{"v":0,"d":"0.00"}},{"$f":"VLOOKUP(AL41,Year_Four[],5)","v":{"v":0,"d":"0.00"}},{"$f":"VLOOKUP(AM41,Year_Four[],5)","v":{"v":0,"d":"0.00"}},{"$f":"VLOOKUP(AN41,Year_Four[],5)","v":{"v":0,"d":"0.00"}},{"$f":"VLOOKUP(AO41,Year_Four[],5)","v":{"v":0,"d":"0.00"}},{"$f":"VLOOKUP(AP41,Year_Four[],5)","v":{"$error":"#N/A"}},{"$f":"VLOOKUP(AQ41,Year_Four[],5)","v":{"$error":"#N/A"}},{"$f":"VLOOKUP(AR41,Year_Four[],5)","v":{"$error":"#N/A"}},{"$f":"VLOOKUP(AS41,Year_Four[],5)","v":{"$error":"#N/A"}},{"$f":"VLOOKUP(AT41,Year_Four[],5)","v":{"$error":"#N/A"}},{"$f":"VLOOKUP(AU41,Year_Four[],5)","v":{"$error":"#N/A"}},{"$f":"VLOOKUP(AV41,Year_Four[],5)","v":{"$error":"#N/A"}}]
[null,2,"PO/EO No.",{"$f":"'Master PO Schedule'!D12","v":"Admin"},{"$f":"'Master PO Schedule'!E12","v":"M425.02"},{"$f":"'Master PO Schedule'!F12","v":"CX05.01"},{"$f":"'Master PO Schedule'!G12","v":"C425.02"},{"$f":"'Master PO Schedule'!H12","v":"C424.02"},{"$f":"'Master PO Schedule'!I12","v":"C424.04"},{"$f":"'Master PO Schedule'!J12","v":"M424.02"},{"$f":"'Master PO Schedule'!K12","v":"M408.02"},{"$f":"'Master PO Schedule'!L12","v":"M408.04"},{"$f":"'Master PO Schedule'!M12","v":"C408.02"},{"$f":"'Master PO Schedule'!N12","v":"M409.02"},{"$f":"'Master PO Schedule'!O12","v":"MX20.01B"},{"$f":"'Master PO Schedule'!P12","v":"CX05.01"},{"$f":"'Master PO Schedule'!Q12","v":"Christmas"},{"$f":"'Master PO Schedule'!R12","v":"Christmas"},{"$f":"'Master PO Schedule'!S12","v":"Christmas"},{"$f":"'Master PO Schedule'!T12","v":"MX20.01A"},{"$f":"'Master PO Schedule'!U12","v":"MX20.01A"},{"$f":"'Master PO Schedule'!V12","v":"Stand Down"},{"$f":"'Master PO Schedule'!W12","v":"MX20.01B"},{"$f":"'Master PO Schedule'!X12","v":"M409.03"},{"$f":"'Master PO Schedule'!Y12","v":"C403.01"},{"$f":"'Master PO Schedule'!Z12","v":"CX05.01"},{"$f":"'Master PO Schedule'!AA12","v":"C422.02"},{"$f":"'Master PO Schedule'!AB12","v":"CX05.01"},{"$f":"'Master PO Schedule'!AC12","v":"C422.02"},{"$f":"'Master PO Schedule'!AD12","v":"March Break"},{"$f":"'Master PO Schedule'!AE12","v":"M422.01"},{"$f":"'Master PO Schedule'!AF12","v":"M422.02"},{"$f":"'Master PO Schedule'!AG12","v":"C422.02"},{"$f":"'Master PO Schedule'!AH12","v":"M425.02"},{"$f":"'Master PO Schedule'!AI12","v":"C424.02"},{"$f":"'Master PO Schedule'!AJ12","v":"C324.02"},{"$f":"'Master PO Schedule'!AK12","v":"C324.02"},{"$f":"'Master PO Schedule'!AL12","v":"M408.02"},{"$f":"'Master PO Schedule'!AM12","v":"C408.01"},{"$f":"'Master PO Schedule'!AN12","v":"M408.01"},{"$f":"'Master PO Schedule'!AO12","v":"M408.01"},{"$f":"'Master PO Schedule'!AP12","v":{"v":0,"d":"0.00"}},{"$f":"'Master PO Schedule'!AQ12","v":{"v":0,"d":"0.00"}},{"$f":"'Master PO Schedule'!AR12","v":{"v":0,"d":"0.00"}},{"$f":"'Master PO Schedule'!AS12","v":{"v":0,"d":"0.00"}},{"$f":"'Master PO Schedule'!AT12","v":{"v":0,"d":"0.00"}},{"$f":"'Master PO Schedule'!AU12","v":{"v":0,"d":"0.00"}},{"$f":"'Master PO Schedule'!AV12","v":{"v":0,"d":"0.00"}}]
[null,null,"PO Title",{"$f":"VLOOKUP(D45,Year_Four[],3)","v":"Annual Review"},{"$f":"VLOOKUP(E45,Year_Four[],3)","v":"Outdoor Leadership"},{"$f":"VLOOKUP(F45,Year_Four[],3)","v":"Physical Activities"},{"$f":"VLOOKUP(G45,Year_Four[],3)","v":"Outdoor Leadership"},{"$f":"VLOOKUP(H45,Year_Four[],3)","v":"Wilderness Survival"},{"$f":"VLOOKUP(I45,Year_Four[],3)","v":"Wilderness Survival"},{"$f":"VLOOKUP(J45,Year_Four[],3)","v":"Wilderness Survival"},{"$f":"VLOOKUP(K45,Year_Four[],3)","v":"Drill"},{"$f":"VLOOKUP(L45,Year_Four[],3)","v":"Drill"},{"$f":"VLOOKUP(M45,Year_Four[],3)","v":"Drill"},{"$f":"VLOOKUP(N45,Year_Four[],3)","v":"IT"},{"$f":"VLOOKUP(O45,Year_Four[],3)","v":"CAF Famil"},{"$f":"VLOOKUP(P45,Year_Four[],3)","v":"Physical Activities"},{"$f":"VLOOKUP(Q45,Year_Four[],3)","v":"No Training"},{"$f":"VLOOKUP(R45,Year_Four[],3)","v":"No Training"},{"$f":"VLOOKUP(S45,Year_Four[],3)","v":"No Training"},{"$f":"VLOOKUP(T45,Year_Four[],3)","v":"CAF Famil"},{"$f":"VLOOKUP(U45,Year_Four[],3)","v":"CAF Famil"},{"$f":"VLOOKUP(V45,Year_Four[],3)","v":"Admin"},{"$f":"VLOOKUP(W45,Year_Four[],3)","v":"CAF Famil"},{"$f":"VLOOKUP(X45,Year_Four[],3)","v":"IT"},{"$f":"VLOOKUP(Y45,Year_Four[],3)","v":"Leadership"},{"$f":"VLOOKUP(Z45,Year_Four[],3)","v":"Physical Activities"},{"$f":"VLOOKUP(AA45,Year_Four[],3)","v":"Navigation"},{"$f":"VLOOKUP(AB45,Year_Four[],3)","v":"Physical Activities"},{"$f":"VLOOKUP(AC45,Year_Four[],3)","v":"Navigation"},{"$f":"VLOOKUP(AD45,Year_Four[],3)","v":"No Training"},{"$f":"VLOOKUP(AE45,Year_Four[],3)","v":"Navigation"},{"$f":"VLOOKUP(AF45,Year_Four[],3)","v":"Navigation"},{"$f":"VLOOKUP(AG45,Year_Four[],3)","v":"Navigation"},{"$f":"VLOOKUP(AH45,Year_Four[],3)","v":"Outdoor Leadership"},{"$f":"VLOOKUP(AI45,Year_Four[],3)","v":"Wilderness Survival"},{"$f":"VLOOKUP(AJ45,Year_Four[],3)","v":"Wilderness Survival"},{"$f":"VLOOKUP(AK45,Year_Four[],3)","v":"Wilderness Survival"},{"$f":"VLOOKUP(AL45,Year_Four[],3)","v":"Drill"},{"$f":"VLOOKUP(AM45,Year_Four[],3)","v":"Drill"},{"$f":"VLOOKUP(AN45,Year_Four[],3)","v":"Drill"},{"$f":"VLOOKUP(AO45,Year_Four[],3)","v":"Drill"},{"$f":"VLOOKUP(AP45,Year_Four[],3)","v":{"$error":"#N/A"}},{"$f":"VLOOKUP(AQ45,Year_Four[],3)","v":{"$error":"#N/A"}},{"$f":"VLOOKUP(AR45,Year_Four[],3)","v":{"$error":"#N/A"}},{"$f":"VLOOKUP(AS45,Year_Four[],3)","v":{"$error":"#N/A"}},{"$f":"VLOOKUP(AT45,Year_Four[],3)","v":{"$error":"#N/A"}},{"$f":"VLOOKUP(AU45,Year_Four[],3)","v":{"$error":"#N/A"}},{"$f":"VLOOKUP(AV45,Year_Four[],3)","v":{"$error":"#N/A"}}]
[null,null,"Instructor",{"$f":"VLOOKUP(D45,Year_Four[],4)","v":{"v":0,"d":"0.00"}},{"$f":"VLOOKUP(E45,Year_Four[],4)","v":{"v":0,"d":"0.00"}},{"$f":"VLOOKUP(F45,Year_Four[],4)","v":{"v":0,"d":"0.00"}},{"$f":"VLOOKUP(G45,Year_Four[],4)","v":{"v":0,"d":"0.00"}},{"$f":"VLOOKUP(H45,Year_Four[],4)","v":{"v":0,"d":"0.00"}},{"$f":"VLOOKUP(I45,Year_Four[],4)","v":{"v":0,"d":"0.00"}},{"$f":"VLOOKUP(J45,Year_Four[],4)","v":{"v":0,"d":"0.00"}},{"$f":"VLOOKUP(K45,Year_Four[],4)","v":{"v":0,"d":"0.00"}},{"$f":"VLOOKUP(L45,Year_Four[],4)","v":{"v":0,"d":"0.00"}},{"$f":"VLOOKUP(M45,Year_Four[],4)","v":{"v":0,"d":"0.00"}},{"$f":"VLOOKUP(N45,Year_Four[],4)","v":{"v":0,"d":"0.00"}},{"$f":"VLOOKUP(O45,Year_Four[],4)","v":{"v":0,"d":"0.00"}},{"$f":"VLOOKUP(P45,Year_Four[],4)","v":{"v":0,"d":"0.00"}},{"$f":"VLOOKUP(Q45,Year_Four[],4)","v":{"v":0,"d":"0.00"}},{"$f":"VLOOKUP(R45,Year_Four[],4)","v":{"v":0,"d":"0.00"}},{"$f":"VLOOKUP(S45,Year_Four[],4)","v":{"v":0,"d":"0.00"}},{"$f":"VLOOKUP(T45,Year_Four[],4)","v":{"v":0,"d":"0.00"}},{"$f":"VLOOKUP(U45,Year_Four[],4)","v":{"v":0,"d":"0.00"}},{"$f":"VLOOKUP(V45,Year_Four[],4)","v":{"v":0,"d":"0.00"}},{"$f":"VLOOKUP(W45,Year_Four[],4)","v":{"v":0,"d":"0.00"}},{"$f":"VLOOKUP(X45,Year_Four[],4)","v":{"v":0,"d":"0.00"}},{"$f":"VLOOKUP(Y45,Year_Four[],4)","v":{"v":0,"d":"0.00"}},{"$f":"VLOOKUP(Z45,Year_Four[],4)","v":{"v":0,"d":"0.00"}},{"$f":"VLOOKUP(AA45,Year_Four[],4)","v":{"v":0,"d":"0.00"}},{"$f":"VLOOKUP(AB45,Year_Four[],4)","v":{"v":0,"d":"0.00"}},{"$f":"VLOOKUP(AC45,Year_Four[],4)","v":{"v":0,"d":"0.00"}},{"$f":"VLOOKUP(AD45,Year_Four[],4)","v":{"v":0,"d":"0.00"}},{"$f":"VLOOKUP(AE45,Year_Four[],4)","v":"Lt Heaton"},{"$f":"VLOOKUP(AF45,Year_Four[],4)","v":"Lt Heaton"},{"$f":"VLOOKUP(AG45,Year_Four[],4)","v":{"v":0,"d":"0.00"}},{"$f":"VLOOKUP(AH45,Year_Four[],4)","v":{"v":0,"d":"0.00"}},{"$f":"VLOOKUP(AI45,Year_Four[],4)","v":{"v":0,"d":"0.00"}},{"$f":"VLOOKUP(AJ45,Year_Four[],4)","v":{"v":0,"d":"0.00"}},{"$f":"VLOOKUP(AK45,Year_Four[],4)","v":{"v":0,"d":"0.00"}},{"$f":"VLOOKUP(AL45,Year_Four[],4)","v":{"v":0,"d":"0.00"}},{"$f":"VLOOKUP(AM45,Year_Four[],4)","v":{"v":0,"d":"0.00"}},{"$f":"VLOOKUP(AN45,Year_Four[],4)","v":{"v":0,"d":"0.00"}},{"$f":"VLOOKUP(AO45,Year_Four[],4)","v":{"v":0,"d":"0.00"}},{"$f":"VLOOKUP(AP45,Year_Four[],4)","v":{"$error":"#N/A"}},{"$f":"VLOOKUP(AQ45,Year_Four[],4)","v":{"$error":"#N/A"}},{"$f":"VLOOKUP(AR45,Year_Four[],4)","v":{"$error":"#N/A"}},{"$f":"VLOOKUP(AS45,Year_Four[],4)","v":{"$error":"#N/A"}},{"$f":"VLOOKUP(AT45,Year_Four[],4)","v":{"$error":"#N/A"}},{"$f":"VLOOKUP(AU45,Year_Four[],4)","v":{"$error":"#N/A"}},{"$f":"VLOOKUP(AV45,Year_Four[],4)","v":{"$error":"#N/A"}}]
[null,null,"Location",{"$f":"VLOOKUP(D45,Year_Four[],5)","v":{"v":0,"d":"0.00"}},{"$f":"VLOOKUP(E45,Year_Four[],5)","v":{"v":0,"d":"0.00"}},{"$f":"VLOOKUP(F45,Year_Four[],5)","v":{"v":0,"d":"0.00"}},{"$f":"VLOOKUP(G45,Year_Four[],5)","v":{"v":0,"d":"0.00"}},{"$f":"VLOOKUP(H45,Year_Four[],5)","v":{"v":0,"d":"0.00"}},{"$f":"VLOOKUP(I45,Year_Four[],5)","v":{"v":0,"d":"0.00"}},{"$f":"VLOOKUP(J45,Year_Four[],5)","v":{"v":0,"d":"0.00"}},{"$f":"VLOOKUP(K45,Year_Four[],5)","v":{"v":0,"d":"0.00"}},{"$f":"VLOOKUP(L45,Year_Four[],5)","v":{"v":0,"d":"0.00"}},{"$f":"VLOOKUP(M45,Year_Four[],5)","v":{"v":0,"d":"0.00"}},{"$f":"VLOOKUP(N45,Year_Four[],5)","v":{"v":0,"d":"0.00"}},{"$f":"VLOOKUP(O45,Year_Four[],5)","v":{"v":0,"d":"0.00"}},{"$f":"VLOOKUP(P45,Year_Four[],5)","v":{"v":0,"d":"0.00"}},{"$f":"VLOOKUP(Q45,Year_Four[],5)","v":{"v":0,"d":"0.00"}},{"$f":"VLOOKUP(R45,Year_Four[],5)","v":{"v":0,"d":"0.00"}},{"$f":"VLOOKUP(S45,Year_Four[],5)","v":{"v":0,"d":"0.00"}},{"$f":"VLOOKUP(T45,Year_Four[],5)","v":{"v":0,"d":"0.00"}},{"$f":"VLOOKUP(U45,Year_Four[],5)","v":{"v":0,"d":"0.00"}},{"$f":"VLOOKUP(V45,Year_Four[],5)","v":{"v":0,"d":"0.00"}},{"$f":"VLOOKUP(W45,Year_Four[],5)","v":{"v":0,"d":"0.00"}},{"$f":"VLOOKUP(X45,Year_Four[],5)","v":{"v":0,"d":"0.00"}},{"$f":"VLOOKUP(Y45,Year_Four[],5)","v":{"v":0,"d":"0.00"}},{"$f":"VLOOKUP(Z45,Year_Four[],5)","v":{"v":0,"d":"0.00"}},{"$f":"VLOOKUP(AA45,Year_Four[],5)","v":{"v":0,"d":"0.00"}},{"$f":"VLOOKUP(AB45,Year_Four[],5)","v":{"v":0,"d":"0.00"}},{"$f":"VLOOKUP(AC45,Year_Four[],5)","v":{"v":0,"d":"0.00"}},{"$f":"VLOOKUP(AD45,Year_Four[],5)","v":{"v":0,"d":"0.00"}},{"$f":"VLOOKUP(AE45,Year_Four[],5)","v":"Upstairs Classroom"},{"$f":"VLOOKUP(AF45,Year_Four[],5)","v":"Upstairs Classroom"},{"$f":"VLOOKUP(AG45,Year_Four[],5)","v":{"v":0,"d":"0.00"}},{"$f":"VLOOKUP(AH45,Year_Four[],5)","v":{"v":0,"d":"0.00"}},{"$f":"VLOOKUP(AI45,Year_Four[],5)","v":{"v":0,"d":"0.00"}},{"$f":"VLOOKUP(AJ45,Year_Four[],5)","v":{"v":0,"d":"0.00"}},{"$f":"VLOOKUP(AK45,Year_Four[],5)","v":{"v":0,"d":"0.00"}},{"$f":"VLOOKUP(AL45,Year_Four[],5)","v":{"v":0,"d":"0.00"}},{"$f":"VLOOKUP(AM45,Year_Four[],5)","v":{"v":0,"d":"0.00"}},{"$f":"VLOOKUP(AN45,Year_Four[],5)","v":{"v":0,"d":"0.00"}},{"$f":"VLOOKUP(AO45,Year_Four[],5)","v":{"v":0,"d":"0.00"}},{"$f":"VLOOKUP(AP45,Year_Four[],5)","v":{"$error":"#N/A"}},{"$f":"VLOOKUP(AQ45,Year_Four[],5)","v":{"$error":"#N/A"}},{"$f":"VLOOKUP(AR45,Year_Four[],5)","v":{"$error":"#N/A"}},{"$f":"VLOOKUP(AS45,Year_Four[],5)","v":{"$error":"#N/A"}},{"$f":"VLOOKUP(AT45,Year_Four[],5)","v":{"$error":"#N/A"}},{"$f":"VLOOKUP(AU45,Year_Four[],5)","v":{"$error":"#N/A"}},{"$f":"VLOOKUP(AV45,Year_Four[],5)","v":{"$error":"#N/A"}}]
[null,3,"PO/EO No.",{"$f":"'Master PO Schedule'!D13","v":"Admin"},{"$f":"'Master PO Schedule'!E13","v":"C424.02"},{"$f":"'Master PO Schedule'!F13","v":"CX05.01"},{"$f":"'Master PO Schedule'!G13","v":"M425.03"},{"$f":"'Master PO Schedule'!H13","v":{"v":400,"d":"400.00"}},{"$f":"'Master PO Schedule'!I13","v":{"v":400,"d":"400.00"}},{"$f":"'Master PO Schedule'!J13","v":{"v":400,"d":"400.00"}},{"$f":"'Master PO Schedule'!K13","v":{"v":400,"d":"400.00"}},{"$f":"'Master PO Schedule'!L13","v":{"v":400,"d":"400.00"}},{"$f":"'Master PO Schedule'!M13","v":{"v":400,"d":"400.00"}},{"$f":"'Master PO Schedule'!N13","v":"C403.01"},{"$f":"'Master PO Schedule'!O13","v":"MX20.01C"},{"$f":"'Master PO Schedule'!P13","v":"CX05.01"},{"$f":"'Master PO Schedule'!Q13","v":"Christmas"},{"$f":"'Master PO Schedule'!R13","v":"Christmas"},{"$f":"'Master PO Schedule'!S13","v":"Christmas"},{"$f":"'Master PO Schedule'!T13","v":"M403.01"},{"$f":"'Master PO Schedule'!U13","v":"M403.01"},{"$f":"'Master PO Schedule'!V13","v":"Stand Down"},{"$f":"'Master PO Schedule'!W13","v":"MX20.01C"},{"$f":"'Master PO Schedule'!X13","v":"M409.04"},{"$f":"'Master PO Schedule'!Y13","v":"M407.03"},{"$f":"'Master PO Schedule'!Z13","v":"CX05.01"},{"$f":"'Master PO Schedule'!AA13","v":"C422.03"},{"$f":"'Master PO Schedule'!AB13","v":"CX05.01"},{"$f":"'Master PO Schedule'!AC13","v":"C422.03"},{"$f":"'Master PO Schedule'!AD13","v":"March Break"},{"$f":"'Master PO Schedule'!AE13","v":"M422.02"},{"$f":"'Master PO Schedule'!AF13","v":"M422.03"},{"$f":"'Master PO Schedule'!AG13","v":"C422.03"},{"$f":"'Master PO Schedule'!AH13","v":"M409.05"},{"$f":"'Master PO Schedule'!AI13","v":"C424.03"},{"$f":"'Master PO Schedule'!AJ13","v":"C324.03"},{"$f":"'Master PO Schedule'!AK13","v":"C324.03"},{"$f":"'Master PO Schedule'!AL13","v":"M408.03"},{"$f":"'Master PO Schedule'!AM13","v":"C408.02"},{"$f":"'Master PO Schedule'!AN13","v":"M408.01"},{"$f":"'Master PO Schedule'!AO13","v":"M408.01"},{"$f":"'Master PO Schedule'!AP13","v":{"v":0,"d":"0.00"}},{"$f":"'Master PO Schedule'!AQ13","v":{"v":0,"d":"0.00"}},{"$f":"'Master PO Schedule'!AR13","v":{"v":0,"d":"0.00"}},{"$f":"'Master PO Schedule'!AS13","v":{"v":0,"d":"0.00"}},{"$f":"'Master PO Schedule'!AT13","v":{"v":0,"d":"0.00"}},{"$f":"'Master PO Schedule'!AU13","v":{"v":0,"d":"0.00"}},{"$f":"'Master PO Schedule'!AV13","v":{"v":0,"d":"0.00"}}]
[null,null,"PO Title",{"$f":"VLOOKUP(D49,Year_Four[],3)","v":"Annual Review"},{"$f":"VLOOKUP(E49,Year_Four[],3)","v":"Wilderness Survival"},{"$f":"VLOOKUP(F49,Year_Four[],3)","v":"Physical Activities"},{"$f":"VLOOKUP(G49,Year_Four[],3)","v":"Outdoor Leadership"},{"$f":"VLOOKUP(H49,Year_Four[],3)","v":"PSRY Training"},{"$f":"VLOOKUP(I49,Year_Four[],3)","v":"PSRY Training"},{"$f":"VLOOKUP(J49,Year_Four[],3)","v":"PSRY Training"},{"$f":"VLOOKUP(K49,Year_Four[],3)","v":"PSRY Training"},{"$f":"VLOOKUP(L49,Year_Four[],3)","v":"PSRY Training"},{"$f":"VLOOKUP(M49,Year_Four[],3)","v":"PSRY Training"},{"$f":"VLOOKUP(N49,Year_Four[],3)","v":"Leadership"},{"$f":"VLOOKUP(O49,Year_Four[],3)","v":"CAF Famil"},{"$f":"VLOOKUP(P49,Year_Four[],3)","v":"Physical Activities"},{"$f":"VLOOKUP(Q49,Year_Four[],3)","v":"No Training"},{"$f":"VLOOKUP(R49,Year_Four[],3)","v":"No Training"},{"$f":"VLOOKUP(S49,Year_Four[],3)","v":"No Training"},{"$f":"VLOOKUP(T49,Year_Four[],3)","v":"Leadership"},{"$f":"VLOOKUP(U49,Year_Four[],3)","v":"Leadership"},{"$f":"VLOOKUP(V49,Year_Four[],3)","v":"Admin"},{"$f":"VLOOKUP(W49,Year_Four[],3)","v":"CAF Famil"},{"$f":"VLOOKUP(X49,Year_Four[],3)","v":"IT"},{"$f":"VLOOKUP(Y49,Year_Four[],3)","v":"GCK"},{"$f":"VLOOKUP(Z49,Year_Four[],3)","v":"Physical Activities"},{"$f":"VLOOKUP(AA49,Year_Four[],3)","v":"Navigation"},{"$f":"VLOOKUP(AB49,Year_Four[],3)","v":"Physical Activities"},{"$f":"VLOOKUP(AC49,Year_Four[],3)","v":"Navigation"},{"$f":"VLOOKUP(AD49,Year_Four[],3)","v":"No Training"},{"$f":"VLOOKUP(AE49,Year_Four[],3)","v":"Navigation"},{"$f":"VLOOKUP(AF49,Year_Four[],3)","v":"Navigation"},{"$f":"VLOOKUP(AG49,Year_Four[],3)","v":"Navigation"},{"$f":"VLOOKUP(AH49,Year_Four[],3)","v":"IT"},{"$f":"VLOOKUP(AI49,Year_Four[],3)","v":"Wilderness Survival"},{"$f":"VLOOKUP(AJ49,Year_Four[],3)","v":"Wilderness Survival"},{"$f":"VLOOKUP(AK49,Year_Four[],3)","v":"Wilderness Survival"},{"$f":"VLOOKUP(AL49,Year_Four[],3)","v":"Drill"},{"$f":"VLOOKUP(AM49,Year_Four[],3)","v":"Drill"},{"$f":"VLOOKUP(AN49,Year_Four[],3)","v":"Drill"},{"$f":"VLOOKUP(AO49,Year_Four[],3)","v":"Drill"},{"$f":"VLOOKUP(AP49,Year_Four[],3)","v":{"$error":"#N/A"}},{"$f":"VLOOKUP(AQ49,Year_Four[],3)","v":{"$error":"#N/A"}},{"$f":"VLOOKUP(AR49,Year_Four[],3)","v":{"$error":"#N/A"}},{"$f":"VLOOKUP(AS49,Year_Four[],3)","v":{"$error":"#N/A"}},{"$f":"VLOOKUP(AT49,Year_Four[],3)","v":{"$error":"#N/A"}},{"$f":"VLOOKUP(AU49,Year_Four[],3)","v":{"$error":"#N/A"}},{"$f":"VLOOKUP(AV49,Year_Four[],3)","v":{"$error":"#N/A"}}]
[null,null,"Instructor",{"$f":"VLOOKUP(D49,Year_Four[],4)","v":{"v":0,"d":"0.00"}},{"$f":"VLOOKUP(E49,Year_Four[],4)","v":{"v":0,"d":"0.00"}},{"$f":"VLOOKUP(F49,Year_Four[],4)","v":{"v":0,"d":"0.00"}},{"$f":"VLOOKUP(G49,Year_Four[],4)","v":{"v":0,"d":"0.00"}},{"$f":"VLOOKUP(H49,Year_Four[],4)","v":{"v":0,"d":"0.00"}},{"$f":"VLOOKUP(I49,Year_Four[],4)","v":{"v":0,"d":"0.00"}},{"$f":"VLOOKUP(J49,Year_Four[],4)","v":{"v":0,"d":"0.00"}},{"$f":"VLOOKUP(K49,Year_Four[],4)","v":{"v":0,"d":"0.00"}},{"$f":"VLOOKUP(L49,Year_Four[],4)","v":{"v":0,"d":"0.00"}},{"$f":"VLOOKUP(M49,Year_Four[],4)","v":{"v":0,"d":"0.00"}},{"$f":"VLOOKUP(N49,Year_Four[],4)","v":{"v":0,"d":"0.00"}},{"$f":"VLOOKUP(O49,Year_Four[],4)","v":{"v":0,"d":"0.00"}},{"$f":"VLOOKUP(P49,Year_Four[],4)","v":{"v":0,"d":"0.00"}},{"$f":"VLOOKUP(Q49,Year_Four[],4)","v":{"v":0,"d":"0.00"}},{"$f":"VLOOKUP(R49,Year_Four[],4)","v":{"v":0,"d":"0.00"}},{"$f":"VLOOKUP(S49,Year_Four[],4)","v":{"v":0,"d":"0.00"}},{"$f":"VLOOKUP(T49,Year_Four[],4)","v":{"v":0,"d":"0.00"}},{"$f":"VLOOKUP(U49,Year_Four[],4)","v":{"v":0,"d":"0.00"}},{"$f":"VLOOKUP(V49,Year_Four[],4)","v":{"v":0,"d":"0.00"}},{"$f":"VLOOKUP(W49,Year_Four[],4)","v":{"v":0,"d":"0.00"}},{"$f":"VLOOKUP(X49,Year_Four[],4)","v":{"v":0,"d":"0.00"}},{"$f":"VLOOKUP(Y49,Year_Four[],4)","v":{"v":0,"d":"0.00"}},{"$f":"VLOOKUP(Z49,Year_Four[],4)","v":{"v":0,"d":"0.00"}},{"$f":"VLOOKUP(AA49,Year_Four[],4)","v":{"v":0,"d":"0.00"}},{"$f":"VLOOKUP(AB49,Year_Four[],4)","v":{"v":0,"d":"0.00"}},{"$f":"VLOOKUP(AC49,Year_Four[],4)","v":{"v":0,"d":"0.00"}},{"$f":"VLOOKUP(AD49,Year_Four[],4)","v":{"v":0,"d":"0.00"}},{"$f":"VLOOKUP(AE49,Year_Four[],4)","v":"Lt Heaton"},{"$f":"VLOOKUP(AF49,Year_Four[],4)","v":{"v":0,"d":"0.00"}},{"$f":"VLOOKUP(AG49,Year_Four[],4)","v":{"v":0,"d":"0.00"}},{"$f":"VLOOKUP(AH49,Year_Four[],4)","v":{"v":0,"d":"0.00"}},{"$f":"VLOOKUP(AI49,Year_Four[],4)","v":{"v":0,"d":"0.00"}},{"$f":"VLOOKUP(AJ49,Year_Four[],4)","v":{"v":0,"d":"0.00"}},{"$f":"VLOOKUP(AK49,Year_Four[],4)","v":{"v":0,"d":"0.00"}},{"$f":"VLOOKUP(AL49,Year_Four[],4)","v":{"v":0,"d":"0.00"}},{"$f":"VLOOKUP(AM49,Year_Four[],4)","v":{"v":0,"d":"0.00"}},{"$f":"VLOOKUP(AN49,Year_Four[],4)","v":{"v":0,"d":"0.00"}},{"$f":"VLOOKUP(AO49,Year_Four[],4)","v":{"v":0,"d":"0.00"}},{"$f":"VLOOKUP(AP49,Year_Four[],4)","v":{"$error":"#N/A"}},{"$f":"VLOOKUP(AQ49,Year_Four[],4)","v":{"$error":"#N/A"}},{"$f":"VLOOKUP(AR49,Year_Four[],4)","v":{"$error":"#N/A"}},{"$f":"VLOOKUP(AS49,Year_Four[],4)","v":{"$error":"#N/A"}},{"$f":"VLOOKUP(AT49,Year_Four[],4)","v":{"$error":"#N/A"}},{"$f":"VLOOKUP(AU49,Year_Four[],4)","v":{"$error":"#N/A"}},{"$f":"VLOOKUP(AV49,Year_Four[],4)","v":{"$error":"#N/A"}}]
[null,null,"Location",{"$f":"VLOOKUP(D49,Year_Four[],5)","v":{"v":0,"d":"0.00"}},{"$f":"VLOOKUP(E49,Year_Four[],5)","v":{"v":0,"d":"0.00"}},{"$f":"VLOOKUP(F49,Year_Four[],5)","v":{"v":0,"d":"0.00"}},{"$f":"VLOOKUP(G49,Year_Four[],5)","v":{"v":0,"d":"0.00"}},{"$f":"VLOOKUP(H49,Year_Four[],5)","v":{"v":0,"d":"0.00"}},{"$f":"VLOOKUP(I49,Year_Four[],5)","v":{"v":0,"d":"0.00"}},{"$f":"VLOOKUP(J49,Year_Four[],5)","v":{"v":0,"d":"0.00"}},{"$f":"VLOOKUP(K49,Year_Four[],5)","v":{"v":0,"d":"0.00"}},{"$f":"VLOOKUP(L49,Year_Four[],5)","v":{"v":0,"d":"0.00"}},{"$f":"VLOOKUP(M49,Year_Four[],5)","v":{"v":0,"d":"0.00"}},{"$f":"VLOOKUP(N49,Year_Four[],5)","v":{"v":0,"d":"0.00"}},{"$f":"VLOOKUP(O49,Year_Four[],5)","v":{"v":0,"d":"0.00"}},{"$f":"VLOOKUP(P49,Year_Four[],5)","v":{"v":0,"d":"0.00"}},{"$f":"VLOOKUP(Q49,Year_Four[],5)","v":{"v":0,"d":"0.00"}},{"$f":"VLOOKUP(R49,Year_Four[],5)","v":{"v":0,"d":"0.00"}},{"$f":"VLOOKUP(S49,Year_Four[],5)","v":{"v":0,"d":"0.00"}},{"$f":"VLOOKUP(T49,Year_Four[],5)","v":{"v":0,"d":"0.00"}},{"$f":"VLOOKUP(U49,Year_Four[],5)","v":{"v":0,"d":"0.00"}},{"$f":"VLOOKUP(V49,Year_Four[],5)","v":{"v":0,"d":"0.00"}},{"$f":"VLOOKUP(W49,Year_Four[],5)","v":{"v":0,"d":"0.00"}},{"$f":"VLOOKUP(X49,Year_Four[],5)","v":{"v":0,"d":"0.00"}},{"$f":"VLOOKUP(Y49,Year_Four[],5)","v":{"v":0,"d":"0.00"}},{"$f":"VLOOKUP(Z49,Year_Four[],5)","v":{"v":0,"d":"0.00"}},{"$f":"VLOOKUP(AA49,Year_Four[],5)","v":{"v":0,"d":"0.00"}},{"$f":"VLOOKUP(AB49,Year_Four[],5)","v":{"v":0,"d":"0.00"}},{"$f":"VLOOKUP(AC49,Year_Four[],5)","v":{"v":0,"d":"0.00"}},{"$f":"VLOOKUP(AD49,Year_Four[],5)","v":{"v":0,"d":"0.00"}},{"$f":"VLOOKUP(AE49,Year_Four[],5)","v":"Upstairs Classroom"},{"$f":"VLOOKUP(AF49,Year_Four[],5)","v":{"v":0,"d":"0.00"}},{"$f":"VLOOKUP(AG49,Year_Four[],5)","v":{"v":0,"d":"0.00"}},{"$f":"VLOOKUP(AH49,Year_Four[],5)","v":{"v":0,"d":"0.00"}},{"$f":"VLOOKUP(AI49,Year_Four[],5)","v":{"v":0,"d":"0.00"}},{"$f":"VLOOKUP(AJ49,Year_Four[],5)","v":{"v":0,"d":"0.00"}},{"$f":"VLOOKUP(AK49,Year_Four[],5)","v":{"v":0,"d":"0.00"}},{"$f":"VLOOKUP(AL49,Year_Four[],5)","v":{"v":0,"d":"0.00"}},{"$f":"VLOOKUP(AM49,Year_Four[],5)","v":{"v":0,"d":"0.00"}},{"$f":"VLOOKUP(AN49,Year_Four[],5)","v":{"v":0,"d":"0.00"}},{"$f":"VLOOKUP(AO49,Year_Four[],5)","v":{"v":0,"d":"0.00"}},{"$f":"VLOOKUP(AP49,Year_Four[],5)","v":{"$error":"#N/A"}},{"$f":"VLOOKUP(AQ49,Year_Four[],5)","v":{"$error":"#N/A"}},{"$f":"VLOOKUP(AR49,Year_Four[],5)","v":{"$error":"#N/A"}},{"$f":"VLOOKUP(AS49,Year_Four[],5)","v":{"$error":"#N/A"}},{"$f":"VLOOKUP(AT49,Year_Four[],5)","v":{"$error":"#N/A"}},{"$f":"VLOOKUP(AU49,Year_Four[],5)","v":{"$error":"#N/A"}},{"$f":"VLOOKUP(AV49,Year_Four[],5)","v":{"$error":"#N/A"}}]
["Master Cadet",1,"PO/EO",{"$f":"'Master PO Schedule'!D14","v":"Admin"},{"$f":"'Master PO Schedule'!E14","v":"C507.01"},{"$f":"'Master PO Schedule'!F14","v":"M504.01"},{"$f":"'Master PO Schedule'!G14","v":"C525.01"},{"$f":"'Master PO Schedule'!H14","v":"M503.01"},{"$f":"'Master PO Schedule'!I14","v":"M503.03"},{"$f":"'Master PO Schedule'!J14","v":"M503.04"},{"$f":"'Master PO Schedule'!K14","v":{"v":0,"d":"0.00"}},{"$f":"'Master PO Schedule'!L14","v":{"v":0,"d":"0.00"}},{"$f":"'Master PO Schedule'!M14","v":{"v":0,"d":"0.00"}},{"$f":"'Master PO Schedule'!N14","v":{"v":0,"d":"0.00"}},{"$f":"'Master PO Schedule'!O14","v":"503 PC"},{"$f":"'Master PO Schedule'!P14","v":"M504.01"},{"$f":"'Master PO Schedule'!Q14","v":"Christmas"},{"$f":"'Master PO Schedule'!R14","v":"Christmas"},{"$f":"'Master PO Schedule'!S14","v":"Christmas"},{"$f":"'Master PO Schedule'!T14","v":{"v":0,"d":"0.00"}},{"$f":"'Master PO Schedule'!U14","v":"503 PC"},{"$f":"'Master PO Schedule'!V14","v":"Stand Down"},{"$f":"'Master PO Schedule'!W14","v":"503 PC"},{"$f":"'Master PO Schedule'!X14","v":"C509.01"},{"$f":"'Master PO Schedule'!Y14","v":"502 PC"},{"$f":"'Master PO Schedule'!Z14","v":"M504.01"},{"$f":"'Master PO Schedule'!AA14","v":{"v":0,"d":"0.00"}},{"$f":"'Master PO Schedule'!AB14","v":"M504.01"},{"$f":"'Master PO Schedule'!AC14","v":{"v":0,"d":"0.00"}},{"$f":"'Master PO Schedule'!AD14","v":"March Break"},{"$f":"'Master PO Schedule'!AE14","v":"CO Parade"},{"$f":"'Master PO Schedule'!AF14","v":{"v":0,"d":"0.00"}},{"$f":"'Master PO Schedule'!AG14","v":{"v":0,"d":"0.00"}},{"$f":"'Master PO Schedule'!AH14","v":{"v":0,"d":"0.00"}},{"$f":"'Master PO Schedule'!AI14","v":{"v":0,"d":"0.00"}},{"$f":"'Master PO Schedule'!AJ14","v":"C522.01"},{"$f":"'Master PO Schedule'!AK14","v":"C522.01"},{"$f":"'Master PO Schedule'!AL14","v":"O-Drill"},{"$f":"'Master PO Schedule'!AM14","v":"O-Drill"},{"$f":"'Master PO Schedule'!AN14","v":"O-Drill"},{"$f":"'Master PO Schedule'!AO14","v":"O-Drill"},{"$f":"'Master PO Schedule'!AP14","v":{"v":0,"d":"0.00"}},{"$f":"'Master PO Schedule'!AQ14","v":{"v":0,"d":"0.00"}},{"$f":"'Master PO Schedule'!AR14","v":{"v":0,"d":"0.00"}},{"$f":"'Master PO Schedule'!AS14","v":{"v":0,"d":"0.00"}},{"$f":"'Master PO Schedule'!AT14","v":{"v":0,"d":"0.00"}},{"$f":"'Master PO Schedule'!AU14","v":{"v":0,"d":"0.00"}},{"$f":"'Master PO Schedule'!AV14","v":{"v":0,"d":"0.00"}}]
[null,null,"PO Title",{"$f":"VLOOKUP(D$53,Year_Five[],3)","v":"Annual Review"},{"$f":"VLOOKUP(E$53,Year_Five[],3)","v":"GCK"},{"$f":"VLOOKUP(F$53,Year_Five[],3)","v":"Fitness & Health"},{"$f":"VLOOKUP(G$53,Year_Five[],3)","v":"Outdoor Leadership"},{"$f":"VLOOKUP(H$53,Year_Five[],3)","v":"Leadership"},{"$f":"VLOOKUP(I$53,Year_Five[],3)","v":"Leadership"},{"$f":"VLOOKUP(J$53,Year_Five[],3)","v":"Leadership"},{"$f":"VLOOKUP(K$53,Year_Five[],3)","v":{"$error":"#N/A"}},{"$f":"VLOOKUP(L$53,Year_Five[],3)","v":{"$error":"#N/A"}},{"$f":"VLOOKUP(M$53,Year_Five[],3)","v":{"$error":"#N/A"}},{"$f":"VLOOKUP(N$53,Year_Five[],3)","v":{"$error":"#N/A"}},{"$f":"VLOOKUP(O$53,Year_Five[],3)","v":"Leadership PC"},{"$f":"VLOOKUP(P$53,Year_Five[],3)","v":"Fitness & Health"},{"$f":"VLOOKUP(Q$53,Year_Five[],3)","v":"No Training"},{"$f":"VLOOKUP(R$53,Year_Five[],3)","v":"No Training"},{"$f":"VLOOKUP(S$53,Year_Five[],3)","v":"No Training"},{"$f":"VLOOKUP(T$53,Year_Five[],3)","v":{"$error":"#N/A"}},{"$f":"VLOOKUP(U$53,Year_Five[],3)","v":"Leadership PC"},{"$f":"VLOOKUP(V$53,Year_Five[],3)","v":"Sports"},{"$f":"VLOOKUP(W$53,Year_Five[],3)","v":"Leadership PC"},{"$f":"VLOOKUP(X$53,Year_Five[],3)","v":"IT"},{"$f":"VLOOKUP(Y$53,Year_Five[],3)","v":"Community Svc PC"},{"$f":"VLOOKUP(Z$53,Year_Five[],3)","v":"Fitness & Health"},{"$f":"VLOOKUP(AA$53,Year_Five[],3)","v":{"$error":"#N/A"}},{"$f":"VLOOKUP(AB$53,Year_Five[],3)","v":"Fitness & Health"},{"$f":"VLOOKUP(AC$53,Year_Five[],3)","v":{"$error":"#N/A"}},{"$f":"VLOOKUP(AD$53,Year_Five[],3)","v":"No Training"},{"$f":"VLOOKUP(AE$53,Year_Five[],3)","v":"CO's Parade"},{"$f":"VLOOKUP(AF$53,Year_Five[],3)","v":{"$error":"#N/A"}},{"$f":"VLOOKUP(AG$53,Year_Five[],3)","v":{"$error":"#N/A"}},{"$f":"VLOOKUP(AH$53,Year_Five[],3)","v":{"$error":"#N/A"}},{"$f":"VLOOKUP(AI$53,Year_Five[],3)","v":{"$error":"#N/A"}},{"$f":"VLOOKUP(AJ$53,Year_Five[],3)","v":"Navigation"},{"$f":"VLOOKUP(AK$53,Year_Five[],3)","v":"Navigation"},{"$f":"VLOOKUP(AL$53,Year_Five[],3)","v":"No Training"},{"$f":"VLOOKUP(AM$53,Year_Five[],3)","v":"No Training"},{"$f":"VLOOKUP(AN$53,Year_Five[],3)","v":"No Training"},{"$f":"VLOOKUP(AO$53,Year_Five[],3)","v":"No Training"},{"$f":"VLOOKUP(AP$53,Year_Five[],3)","v":{"$error":"#N/A"}},{"$f":"VLOOKUP(AQ$53,Year_Five[],3)","v":{"$error":"#N/A"}},{"$f":"VLOOKUP(AR$53,Year_Five[],3)","v":{"$error":"#N/A"}},{"$f":"VLOOKUP(AS$53,Year_Five[],3)","v":{"$error":"#N/A"}},{"$f":"VLOOKUP(AT$53,Year_Five[],3)","v":{"$error":"#N/A"}},{"$f":"VLOOKUP(AU$53,Year_Five[],3)","v":{"$error":"#N/A"}},{"$f":"VLOOKUP(AV$53,Year_Five[],3)","v":{"$error":"#N/A"}}]
[null,null,"Instructor",{"$f":"VLOOKUP(D$53,Year_Five[],4)","v":{"v":0,"d":"0.00"}},{"$f":"VLOOKUP(E$53,Year_Five[],4)","v":{"v":0,"d":"0.00"}},{"$f":"VLOOKUP(F$53,Year_Five[],4)","v":{"v":0,"d":"0.00"}},{"$f":"VLOOKUP(G$53,Year_Five[],4)","v":{"v":0,"d":"0.00"}},{"$f":"VLOOKUP(H$53,Year_Five[],4)","v":{"v":0,"d":"0.00"}},{"$f":"VLOOKUP(I$53,Year_Five[],4)","v":{"v":0,"d":"0.00"}},{"$f":"VLOOKUP(J$53,Year_Five[],4)","v":{"v":0,"d":"0.00"}},{"$f":"VLOOKUP(K$53,Year_Five[],4)","v":{"$error":"#N/A"}},{"$f":"VLOOKUP(L$53,Year_Five[],4)","v":{"$error":"#N/A"}},{"$f":"VLOOKUP(M$53,Year_Five[],4)","v":{"$error":"#N/A"}},{"$f":"VLOOKUP(N$53,Year_Five[],4)","v":{"$error":"#N/A"}},{"$f":"VLOOKUP(O$53,Year_Five[],4)","v":{"v":0,"d":"0.00"}},{"$f":"VLOOKUP(P$53,Year_Five[],4)","v":{"v":0,"d":"0.00"}},{"$f":"VLOOKUP(Q$53,Year_Five[],4)","v":{"v":0,"d":"0.00"}},{"$f":"VLOOKUP(R$53,Year_Five[],4)","v":{"v":0,"d":"0.00"}},{"$f":"VLOOKUP(S$53,Year_Five[],4)","v":{"v":0,"d":"0.00"}},{"$f":"VLOOKUP(T$53,Year_Five[],4)","v":{"$error":"#N/A"}},{"$f":"VLOOKUP(U$53,Year_Five[],4)","v":{"v":0,"d":"0.00"}},{"$f":"VLOOKUP(V$53,Year_Five[],4)","v":{"v":0,"d":"0.00"}},{"$f":"VLOOKUP(W$53,Year_Five[],4)","v":{"v":0,"d":"0.00"}},{"$f":"VLOOKUP(X$53,Year_Five[],4)","v":{"v":0,"d":"0.00"}},{"$f":"VLOOKUP(Y$53,Year_Five[],4)","v":{"v":0,"d":"0.00"}},{"$f":"VLOOKUP(Z$53,Year_Five[],4)","v":{"v":0,"d":"0.00"}},{"$f":"VLOOKUP(AA$53,Year_Five[],4)","v":{"$error":"#N/A"}},{"$f":"VLOOKUP(AB$53,Year_Five[],4)","v":{"v":0,"d":"0.00"}},{"$f":"VLOOKUP(AC$53,Year_Five[],4)","v":{"$error":"#N/A"}},{"$f":"VLOOKUP(AD$53,Year_Five[],4)","v":{"v":0,"d":"0.00"}},{"$f":"VLOOKUP(AE$53,Year_Five[],4)","v":"CO"},{"$f":"VLOOKUP(AF$53,Year_Five[],4)","v":{"$error":"#N/A"}},{"$f":"VLOOKUP(AG$53,Year_Five[],4)","v":{"$error":"#N/A"}},{"$f":"VLOOKUP(AH$53,Year_Five[],4)","v":{"$error":"#N/A"}},{"$f":"VLOOKUP(AI$53,Year_Five[],4)","v":{"$error":"#N/A"}},{"$f":"VLOOKUP(AJ$53,Year_Five[],4)","v":{"v":0,"d":"0.00"}},{"$f":"VLOOKUP(AK$53,Year_Five[],4)","v":{"v":0,"d":"0.00"}},{"$f":"VLOOKUP(AL$53,Year_Five[],4)","v":{"v":0,"d":"0.00"}},{"$f":"VLOOKUP(AM$53,Year_Five[],4)","v":{"v":0,"d":"0.00"}},{"$f":"VLOOKUP(AN$53,Year_Five[],4)","v":{"v":0,"d":"0.00"}},{"$f":"VLOOKUP(AO$53,Year_Five[],4)","v":{"v":0,"d":"0.00"}},{"$f":"VLOOKUP(AP$53,Year_Five[],4)","v":{"$error":"#N/A"}},{"$f":"VLOOKUP(AQ$53,Year_Five[],4)","v":{"$error":"#N/A"}},{"$f":"VLOOKUP(AR$53,Year_Five[],4)","v":{"$error":"#N/A"}},{"$f":"VLOOKUP(AS$53,Year_Five[],4)","v":{"$error":"#N/A"}},{"$f":"VLOOKUP(AT$53,Year_Five[],4)","v":{"$error":"#N/A"}},{"$f":"VLOOKUP(AU$53,Year_Five[],4)","v":{"$error":"#N/A"}},{"$f":"VLOOKUP(AV$53,Year_Five[],4)","v":{"$error":"#N/A"}}]
[null,null,"Location",{"$f":"VLOOKUP(D$53,Year_Five[],5)","v":{"v":0,"d":"0.00"}},{"$f":"VLOOKUP(E$53,Year_Five[],5)","v":{"v":0,"d":"0.00"}},{"$f":"VLOOKUP(F$53,Year_Five[],5)","v":{"v":0,"d":"0.00"}},{"$f":"VLOOKUP(G$53,Year_Five[],5)","v":{"v":0,"d":"0.00"}},{"$f":"VLOOKUP(H$53,Year_Five[],5)","v":{"v":0,"d":"0.00"}},{"$f":"VLOOKUP(I$53,Year_Five[],5)","v":{"v":0,"d":"0.00"}},{"$f":"VLOOKUP(J$53,Year_Five[],5)","v":{"v":0,"d":"0.00"}},{"$f":"VLOOKUP(K$53,Year_Five[],5)","v":{"$error":"#N/A"}},{"$f":"VLOOKUP(L$53,Year_Five[],5)","v":{"$error":"#N/A"}},{"$f":"VLOOKUP(M$53,Year_Five[],5)","v":{"$error":"#N/A"}},{"$f":"VLOOKUP(N$53,Year_Five[],5)","v":{"$error":"#N/A"}},{"$f":"VLOOKUP(O$53,Year_Five[],5)","v":{"v":0,"d":"0.00"}},{"$f":"VLOOKUP(P$53,Year_Five[],5)","v":{"v":0,"d":"0.00"}},{"$f":"VLOOKUP(Q$53,Year_Five[],5)","v":{"v":0,"d":"0.00"}},{"$f":"VLOOKUP(R$53,Year_Five[],5)","v":{"v":0,"d":"0.00"}},{"$f":"VLOOKUP(S$53,Year_Five[],5)","v":{"v":0,"d":"0.00"}},{"$f":"VLOOKUP(T$53,Year_Five[],5)","v":{"$error":"#N/A"}},{"$f":"VLOOKUP(U$53,Year_Five[],5)","v":{"v":0,"d":"0.00"}},{"$f":"VLOOKUP(V$53,Year_Five[],5)","v":{"v":0,"d":"0.00"}},{"$f":"VLOOKUP(W$53,Year_Five[],5)","v":{"v":0,"d":"0.00"}},{"$f":"VLOOKUP(X$53,Year_Five[],5)","v":{"v":0,"d":"0.00"}},{"$f":"VLOOKUP(Y$53,Year_Five[],5)","v":{"v":0,"d":"0.00"}},{"$f":"VLOOKUP(Z$53,Year_Five[],5)","v":{"v":0,"d":"0.00"}},{"$f":"VLOOKUP(AA$53,Year_Five[],5)","v":{"$error":"#N/A"}},{"$f":"VLOOKUP(AB$53,Year_Five[],5)","v":{"v":0,"d":"0.00"}},{"$f":"VLOOKUP(AC$53,Year_Five[],5)","v":{"$error":"#N/A"}},{"$f":"VLOOKUP(AD$53,Year_Five[],5)","v":{"v":0,"d":"0.00"}},{"$f":"VLOOKUP(AE$53,Year_Five[],5)","v":"Parking Lot"},{"$f":"VLOOKUP(AF$53,Year_Five[],5)","v":{"$error":"#N/A"}},{"$f":"VLOOKUP(AG$53,Year_Five[],5)","v":{"$error":"#N/A"}},{"$f":"VLOOKUP(AH$53,Year_Five[],5)","v":{"$error":"#N/A"}},{"$f":"VLOOKUP(AI$53,Year_Five[],5)","v":{"$error":"#N/A"}},{"$f":"VLOOKUP(AJ$53,Year_Five[],5)","v":{"v":0,"d":"0.00"}},{"$f":"VLOOKUP(AK$53,Year_Five[],5)","v":{"v":0,"d":"0.00"}},{"$f":"VLOOKUP(AL$53,Year_Five[],5)","v":{"v":0,"d":"0.00"}},{"$f":"VLOOKUP(AM$53,Year_Five[],5)","v":{"v":0,"d":"0.00"}},{"$f":"VLOOKUP(AN$53,Year_Five[],5)","v":{"v":0,"d":"0.00"}},{"$f":"VLOOKUP(AO$53,Year_Five[],5)","v":{"v":0,"d":"0.00"}},{"$f":"VLOOKUP(AP$53,Year_Five[],5)","v":{"$error":"#N/A"}},{"$f":"VLOOKUP(AQ$53,Year_Five[],5)","v":{"$error":"#N/A"}},{"$f":"VLOOKUP(AR$53,Year_Five[],5)","v":{"$error":"#N/A"}},{"$f":"VLOOKUP(AS$53,Year_Five[],5)","v":{"$error":"#N/A"}},{"$f":"VLOOKUP(AT$53,Year_Five[],5)","v":{"$error":"#N/A"}},{"$f":"VLOOKUP(AU$53,Year_Five[],5)","v":{"$error":"#N/A"}},{"$f":"VLOOKUP(AV$53,Year_Five[],5)","v":{"$error":"#N/A"}}]
[null,2,"PO/EO",{"$f":"'Master PO Schedule'!D15","v":"Admin"},{"$f":"'Master PO Schedule'!E15","v":"C507.01"},{"$f":"'Master PO Schedule'!F15","v":"M504.01"},{"$f":"'Master PO Schedule'!G15","v":"C525.02"},{"$f":"'Master PO Schedule'!H15","v":"M503.02"},{"$f":"'Master PO Schedule'!I15","v":"C521.01"},{"$f":"'Master PO Schedule'!J15","v":{"v":0,"d":"0.00"}},{"$f":"'Master PO Schedule'!K15","v":{"v":0,"d":"0.00"}},{"$f":"'Master PO Schedule'!L15","v":{"v":0,"d":"0.00"}},{"$f":"'Master PO Schedule'!M15","v":{"v":0,"d":"0.00"}},{"$f":"'Master PO Schedule'!N15","v":{"v":0,"d":"0.00"}},{"$f":"'Master PO Schedule'!O15","v":"503 PC"},{"$f":"'Master PO Schedule'!P15","v":"M504.01"},{"$f":"'Master PO Schedule'!Q15","v":"Christmas"},{"$f":"'Master PO Schedule'!R15","v":"Christmas"},{"$f":"'Master PO Schedule'!S15","v":"Christmas"},{"$f":"'Master PO Schedule'!T15","v":{"v":0,"d":"0.00"}},{"$f":"'Master PO Schedule'!U15","v":"503 PC"},{"$f":"'Master PO Schedule'!V15","v":"Stand Down"},{"$f":"'Master PO Schedule'!W15","v":"503 PC"},{"$f":"'Master PO Schedule'!X15","v":"C509.01"},{"$f":"'Master PO Schedule'!Y15","v":{"v":0,"d":"0.00"}},{"$f":"'Master PO Schedule'!Z15","v":"M504.01"},{"$f":"'Master PO Schedule'!AA15","v":{"v":0,"d":"0.00"}},{"$f":"'Master PO Schedule'!AB15","v":"M504.01"},{"$f":"'Master PO Schedule'!AC15","v":{"v":0,"d":"0.00"}},{"$f":"'Master PO Schedule'!AD15","v":"March Break"},{"$f":"'Master PO Schedule'!AE15","v":{"v":0,"d":"0.00"}},{"$f":"'Master PO Schedule'!AF15","v":{"v":0,"d":"0.00"}},{"$f":"'Master PO Schedule'!AG15","v":{"v":0,"d":"0.00"}},{"$f":"'Master PO Schedule'!AH15","v":{"v":0,"d":"0.00"}},{"$f":"'Master PO Schedule'!AI15","v":{"v":0,"d":"0.00"}},{"$f":"'Master PO Schedule'!AJ15","v":"C522.01"},{"$f":"'Master PO Schedule'!AK15","v":"C522.01"},{"$f":"'Master PO Schedule'!AL15","v":"O-Drill"},{"$f":"'Master PO Schedule'!AM15","v":"O-Drill"},{"$f":"'Master PO Schedule'!AN15","v":"O-Drill"},{"$f":"'Master PO Schedule'!AO15","v":"O-Drill"},{"$f":"'Master PO Schedule'!AP15","v":{"v":0,"d":"0.00"}},{"$f":"'Master PO Schedule'!AQ15","v":{"v":0,"d":"0.00"}},{"$f":"'Master PO Schedule'!AR15","v":{"v":0,"d":"0.00"}},{"$f":"'Master PO Schedule'!AS15","v":{"v":0,"d":"0.00"}},{"$f":"'Master PO Schedule'!AT15","v":{"v":0,"d":"0.00"}},{"$f":"'Master PO Schedule'!AU15","v":{"v":0,"d":"0.00"}},{"$f":"'Master PO Schedule'!AV15","v":{"v":0,"d":"0.00"}}]
[null,null,"PO Title",{"$f":"VLOOKUP(D$57,Year_Five[],3)","v":"Annual Review"},{"$f":"VLOOKUP(E$57,Year_Five[],3)","v":"GCK"},{"$f":"VLOOKUP(F$57,Year_Five[],3)","v":"Fitness & Health"},{"$f":"VLOOKUP(G$57,Year_Five[],3)","v":"Outdoor Leadership"},{"$f":"VLOOKUP(H$57,Year_Five[],3)","v":"Leadership"},{"$f":"VLOOKUP(I$57,Year_Five[],3)","v":"Field Training"},{"$f":"VLOOKUP(J$57,Year_Five[],3)","v":{"$error":"#N/A"}},{"$f":"VLOOKUP(K$57,Year_Five[],3)","v":{"$error":"#N/A"}},{"$f":"VLOOKUP(L$57,Year_Five[],3)","v":{"$error":"#N/A"}},{"$f":"VLOOKUP(M$57,Year_Five[],3)","v":{"$error":"#N/A"}},{"$f":"VLOOKUP(N$57,Year_Five[],3)","v":{"$error":"#N/A"}},{"$f":"VLOOKUP(O$57,Year_Five[],3)","v":"Leadership PC"},{"$f":"VLOOKUP(P$57,Year_Five[],3)","v":"Fitness & Health"},{"$f":"VLOOKUP(Q$57,Year_Five[],3)","v":"No Training"},{"$f":"VLOOKUP(R$57,Year_Five[],3)","v":"No Training"},{"$f":"VLOOKUP(S$57,Year_Five[],3)","v":"No Training"},{"$f":"VLOOKUP(T$57,Year_Five[],3)","v":{"$error":"#N/A"}},{"$f":"VLOOKUP(U$57,Year_Five[],3)","v":"Leadership PC"},{"$f":"VLOOKUP(V$57,Year_Five[],3)","v":"Sports"},{"$f":"VLOOKUP(W$57,Year_Five[],3)","v":"Leadership PC"},{"$f":"VLOOKUP(X$57,Year_Five[],3)","v":"IT"},{"$f":"VLOOKUP(Y$57,Year_Five[],3)","v":{"$error":"#N/A"}},{"$f":"VLOOKUP(Z$57,Year_Five[],3)","v":"Fitness & Health"},{"$f":"VLOOKUP(AA$57,Year_Five[],3)","v":{"$error":"#N/A"}},{"$f":"VLOOKUP(AB$57,Year_Five[],3)","v":"Fitness & Health"},{"$f":"VLOOKUP(AC$57,Year_Five[],3)","v":{"$error":"#N/A"}},{"$f":"VLOOKUP(AD$57,Year_Five[],3)","v":"No Training"},{"$f":"VLOOKUP(AE$57,Year_Five[],3)","v":{"$error":"#N/A"}},{"$f":"VLOOKUP(AF$57,Year_Five[],3)","v":{"$error":"#N/A"}},{"$f":"VLOOKUP(AG$57,Year_Five[],3)","v":{"$error":"#N/A"}},{"$f":"VLOOKUP(AH$57,Year_Five[],3)","v":{"$error":"#N/A"}},{"$f":"VLOOKUP(AI$57,Year_Five[],3)","v":{"$error":"#N/A"}},{"$f":"VLOOKUP(AJ$57,Year_Five[],3)","v":"Navigation"},{"$f":"VLOOKUP(AK$57,Year_Five[],3)","v":"Navigation"},{"$f":"VLOOKUP(AL$57,Year_Five[],3)","v":"No Training"},{"$f":"VLOOKUP(AM$57,Year_Five[],3)","v":"No Training"},{"$f":"VLOOKUP(AN$57,Year_Five[],3)","v":"No Training"},{"$f":"VLOOKUP(AO$57,Year_Five[],3)","v":"No Training"},{"$f":"VLOOKUP(AP$57,Year_Five[],3)","v":{"$error":"#N/A"}},{"$f":"VLOOKUP(AQ$57,Year_Five[],3)","v":{"$error":"#N/A"}},{"$f":"VLOOKUP(AR$57,Year_Five[],3)","v":{"$error":"#N/A"}},{"$f":"VLOOKUP(AS$57,Year_Five[],3)","v":{"$error":"#N/A"}},{"$f":"VLOOKUP(AT$57,Year_Five[],3)","v":{"$error":"#N/A"}},{"$f":"VLOOKUP(AU$57,Year_Five[],3)","v":{"$error":"#N/A"}},{"$f":"VLOOKUP(AV$57,Year_Five[],3)","v":{"$error":"#N/A"}}]
[null,null,"Instructor",{"$f":"VLOOKUP(D$57,Year_Five[],4)","v":{"v":0,"d":"0.00"}},{"$f":"VLOOKUP(E$57,Year_Five[],4)","v":{"v":0,"d":"0.00"}},{"$f":"VLOOKUP(F$57,Year_Five[],4)","v":{"v":0,"d":"0.00"}},{"$f":"VLOOKUP(G$57,Year_Five[],4)","v":{"v":0,"d":"0.00"}},{"$f":"VLOOKUP(H$57,Year_Five[],4)","v":{"v":0,"d":"0.00"}},{"$f":"VLOOKUP(I$57,Year_Five[],4)","v":{"v":0,"d":"0.00"}},{"$f":"VLOOKUP(J$57,Year_Five[],4)","v":{"$error":"#N/A"}},{"$f":"VLOOKUP(K$57,Year_Five[],4)","v":{"$error":"#N/A"}},{"$f":"VLOOKUP(L$57,Year_Five[],4)","v":{"$error":"#N/A"}},{"$f":"VLOOKUP(M$57,Year_Five[],4)","v":{"$error":"#N/A"}},{"$f":"VLOOKUP(N$57,Year_Five[],4)","v":{"$error":"#N/A"}},{"$f":"VLOOKUP(O$57,Year_Five[],4)","v":{"v":0,"d":"0.00"}},{"$f":"VLOOKUP(P$57,Year_Five[],4)","v":{"v":0,"d":"0.00"}},{"$f":"VLOOKUP(Q$57,Year_Five[],4)","v":{"v":0,"d":"0.00"}},{"$f":"VLOOKUP(R$57,Year_Five[],4)","v":{"v":0,"d":"0.00"}},{"$f":"VLOOKUP(S$57,Year_Five[],4)","v":{"v":0,"d":"0.00"}},{"$f":"VLOOKUP(T$57,Year_Five[],4)","v":{"$error":"#N/A"}},{"$f":"VLOOKUP(U$57,Year_Five[],4)","v":{"v":0,"d":"0.00"}},{"$f":"VLOOKUP(V$57,Year_Five[],4)","v":{"v":0,"d":"0.00"}},{"$f":"VLOOKUP(W$57,Year_Five[],4)","v":{"v":0,"d":"0.00"}},{"$f":"VLOOKUP(X$57,Year_Five[],4)","v":{"v":0,"d":"0.00"}},{"$f":"VLOOKUP(Y$57,Year_Five[],4)","v":{"$error":"#N/A"}},{"$f":"VLOOKUP(Z$57,Year_Five[],4)","v":{"v":0,"d":"0.00"}},{"$f":"VLOOKUP(AA$57,Year_Five[],4)","v":{"$error":"#N/A"}},{"$f":"VLOOKUP(AB$57,Year_Five[],4)","v":{"v":0,"d":"0.00"}},{"$f":"VLOOKUP(AC$57,Year_Five[],4)","v":{"$error":"#N/A"}},{"$f":"VLOOKUP(AD$57,Year_Five[],4)","v":{"v":0,"d":"0.00"}},{"$f":"VLOOKUP(AE$57,Year_Five[],4)","v":{"$error":"#N/A"}},{"$f":"VLOOKUP(AF$57,Year_Five[],4)","v":{"$error":"#N/A"}},{"$f":"VLOOKUP(AG$57,Year_Five[],4)","v":{"$error":"#N/A"}},{"$f":"VLOOKUP(AH$57,Year_Five[],4)","v":{"$error":"#N/A"}},{"$f":"VLOOKUP(AI$57,Year_Five[],4)","v":{"$error":"#N/A"}},{"$f":"VLOOKUP(AJ$57,Year_Five[],4)","v":{"v":0,"d":"0.00"}},{"$f":"VLOOKUP(AK$57,Year_Five[],4)","v":{"v":0,"d":"0.00"}},{"$f":"VLOOKUP(AL$57,Year_Five[],4)","v":{"v":0,"d":"0.00"}},{"$f":"VLOOKUP(AM$57,Year_Five[],4)","v":{"v":0,"d":"0.00"}},{"$f":"VLOOKUP(AN$57,Year_Five[],4)","v":{"v":0,"d":"0.00"}},{"$f":"VLOOKUP(AO$57,Year_Five[],4)","v":{"v":0,"d":"0.00"}},{"$f":"VLOOKUP(AP$57,Year_Five[],4)","v":{"$error":"#N/A"}},{"$f":"VLOOKUP(AQ$57,Year_Five[],4)","v":{"$error":"#N/A"}},{"$f":"VLOOKUP(AR$57,Year_Five[],4)","v":{"$error":"#N/A"}},{"$f":"VLOOKUP(AS$57,Year_Five[],4)","v":{"$error":"#N/A"}},{"$f":"VLOOKUP(AT$57,Year_Five[],4)","v":{"$error":"#N/A"}},{"$f":"VLOOKUP(AU$57,Year_Five[],4)","v":{"$error":"#N/A"}},{"$f":"VLOOKUP(AV$57,Year_Five[],4)","v":{"$error":"#N/A"}}]
[null,null,"Location",{"$f":"VLOOKUP(D$57,Year_Five[],5)","v":{"v":0,"d":"0.00"}},{"$f":"VLOOKUP(E$57,Year_Five[],5)","v":{"v":0,"d":"0.00"}},{"$f":"VLOOKUP(F$57,Year_Five[],5)","v":{"v":0,"d":"0.00"}},{"$f":"VLOOKUP(G$57,Year_Five[],5)","v":{"v":0,"d":"0.00"}},{"$f":"VLOOKUP(H$57,Year_Five[],5)","v":{"v":0,"d":"0.00"}},{"$f":"VLOOKUP(I$57,Year_Five[],5)","v":{"v":0,"d":"0.00"}},{"$f":"VLOOKUP(J$57,Year_Five[],5)","v":{"$error":"#N/A"}},{"$f":"VLOOKUP(K$57,Year_Five[],5)","v":{"$error":"#N/A"}},{"$f":"VLOOKUP(L$57,Year_Five[],5)","v":{"$error":"#N/A"}},{"$f":"VLOOKUP(M$57,Year_Five[],5)","v":{"$error":"#N/A"}},{"$f":"VLOOKUP(N$57,Year_Five[],5)","v":{"$error":"#N/A"}},{"$f":"VLOOKUP(O$57,Year_Five[],5)","v":{"v":0,"d":"0.00"}},{"$f":"VLOOKUP(P$57,Year_Five[],5)","v":{"v":0,"d":"0.00"}},{"$f":"VLOOKUP(Q$57,Year_Five[],5)","v":{"v":0,"d":"0.00"}},{"$f":"VLOOKUP(R$57,Year_Five[],5)","v":{"v":0,"d":"0.00"}},{"$f":"VLOOKUP(S$57,Year_Five[],5)","v":{"v":0,"d":"0.00"}},{"$f":"VLOOKUP(T$57,Year_Five[],5)","v":{"$error":"#N/A"}},{"$f":"VLOOKUP(U$57,Year_Five[],5)","v":{"v":0,"d":"0.00"}},{"$f":"VLOOKUP(V$57,Year_Five[],5)","v":{"v":0,"d":"0.00"}},{"$f":"VLOOKUP(W$57,Year_Five[],5)","v":{"v":0,"d":"0.00"}},{"$f":"VLOOKUP(X$57,Year_Five[],5)","v":{"v":0,"d":"0.00"}},{"$f":"VLOOKUP(Y$57,Year_Five[],5)","v":{"$error":"#N/A"}},{"$f":"VLOOKUP(Z$57,Year_Five[],5)","v":{"v":0,"d":"0.00"}},{"$f":"VLOOKUP(AA$57,Year_Five[],5)","v":{"$error":"#N/A"}},{"$f":"VLOOKUP(AB$57,Year_Five[],5)","v":{"v":0,"d":"0.00"}},{"$f":"VLOOKUP(AC$57,Year_Five[],5)","v":{"$error":"#N/A"}},{"$f":"VLOOKUP(AD$57,Year_Five[],5)","v":{"v":0,"d":"0.00"}},{"$f":"VLOOKUP(AE$57,Year_Five[],5)","v":{"$error":"#N/A"}},{"$f":"VLOOKUP(AF$57,Year_Five[],5)","v":{"$error":"#N/A"}},{"$f":"VLOOKUP(AG$57,Year_Five[],5)","v":{"$error":"#N/A"}},{"$f":"VLOOKUP(AH$57,Year_Five[],5)","v":{"$error":"#N/A"}},{"$f":"VLOOKUP(AI$57,Year_Five[],5)","v":{"$error":"#N/A"}},{"$f":"VLOOKUP(AJ$57,Year_Five[],5)","v":{"v":0,"d":"0.00"}},{"$f":"VLOOKUP(AK$57,Year_Five[],5)","v":{"v":0,"d":"0.00"}},{"$f":"VLOOKUP(AL$57,Year_Five[],5)","v":{"v":0,"d":"0.00"}},{"$f":"VLOOKUP(AM$57,Year_Five[],5)","v":{"v":0,"d":"0.00"}},{"$f":"VLOOKUP(AN$57,Year_Five[],5)","v":{"v":0,"d":"0.00"}},{"$f":"VLOOKUP(AO$57,Year_Five[],5)","v":{"v":0,"d":"0.00"}},{"$f":"VLOOKUP(AP$57,Year_Five[],5)","v":{"$error":"#N/A"}},{"$f":"VLOOKUP(AQ$57,Year_Five[],5)","v":{"$error":"#N/A"}},{"$f":"VLOOKUP(AR$57,Year_Five[],5)","v":{"$error":"#N/A"}},{"$f":"VLOOKUP(AS$57,Year_Five[],5)","v":{"$error":"#N/A"}},{"$f":"VLOOKUP(AT$57,Year_Five[],5)","v":{"$error":"#N/A"}},{"$f":"VLOOKUP(AU$57,Year_Five[],5)","v":{"$error":"#N/A"}},{"$f":"VLOOKUP(AV$57,Year_Five[],5)","v":{"$error":"#N/A"}}]
[null,3,"PO/EO",{"$f":"'Master PO Schedule'!D16","v":"Admin"},{"$f":"'Master PO Schedule'!E16","v":"C507.01"},{"$f":"'Master PO Schedule'!F16","v":"M504.01"},{"$f":"'Master PO Schedule'!G16","v":"C525.03"},{"$f":"'Master PO Schedule'!H16","v":{"v":0,"d":"0.00"}},{"$f":"'Master PO Schedule'!I16","v":"C522.01"},{"$f":"'Master PO Schedule'!J16","v":{"v":0,"d":"0.00"}},{"$f":"'Master PO Schedule'!K16","v":{"v":0,"d":"0.00"}},{"$f":"'Master PO Schedule'!L16","v":{"v":0,"d":"0.00"}},{"$f":"'Master PO Schedule'!M16","v":{"v":0,"d":"0.00"}},{"$f":"'Master PO Schedule'!N16","v":{"v":0,"d":"0.00"}},{"$f":"'Master PO Schedule'!O16","v":"503 PC"},{"$f":"'Master PO Schedule'!P16","v":"M504.01"},{"$f":"'Master PO Schedule'!Q16","v":"Christmas"},{"$f":"'Master PO Schedule'!R16","v":"Christmas"},{"$f":"'Master PO Schedule'!S16","v":"Christmas"},{"$f":"'Master PO Schedule'!T16","v":{"v":0,"d":"0.00"}},{"$f":"'Master PO Schedule'!U16","v":"503 PC"},{"$f":"'Master PO Schedule'!V16","v":"Stand Down"},{"$f":"'Master PO Schedule'!W16","v":"503 PC"},{"$f":"'Master PO Schedule'!X16","v":"509 PC"},{"$f":"'Master PO Schedule'!Y16","v":{"v":0,"d":"0.00"}},{"$f":"'Master PO Schedule'!Z16","v":"M504.01"},{"$f":"'Master PO Schedule'!AA16","v":{"v":0,"d":"0.00"}},{"$f":"'Master PO Schedule'!AB16","v":"M504.01"},{"$f":"'Master PO Schedule'!AC16","v":{"v":0,"d":"0.00"}},{"$f":"'Master PO Schedule'!AD16","v":"March Break"},{"$f":"'Master PO Schedule'!AE16","v":{"v":0,"d":"0.00"}},{"$f":"'Master PO Schedule'!AF16","v":{"v":0,"d":"0.00"}},{"$f":"'Master PO Schedule'!AG16","v":{"v":0,"d":"0.00"}},{"$f":"'Master PO Schedule'!AH16","v":{"v":0,"d":"0.00"}},{"$f":"'Master PO Schedule'!AI16","v":{"v":0,"d":"0.00"}},{"$f":"'Master PO Schedule'!AJ16","v":"C522.03"},{"$f":"'Master PO Schedule'!AK16","v":"C522.03"},{"$f":"'Master PO Schedule'!AL16","v":"O-Drill"},{"$f":"'Master PO Schedule'!AM16","v":"O-Drill"},{"$f":"'Master PO Schedule'!AN16","v":"O-Drill"},{"$f":"'Master PO Schedule'!AO16","v":"O-Drill"},{"$f":"'Master PO Schedule'!AP16","v":{"v":0,"d":"0.00"}},{"$f":"'Master PO Schedule'!AQ16","v":{"v":0,"d":"0.00"}},{"$f":"'Master PO Schedule'!AR16","v":{"v":0,"d":"0.00"}},{"$f":"'Master PO Schedule'!AS16","v":{"v":0,"d":"0.00"}},{"$f":"'Master PO Schedule'!AT16","v":{"v":0,"d":"0.00"}},{"$f":"'Master PO Schedule'!AU16","v":{"v":0,"d":"0.00"}},{"$f":"'Master PO Schedule'!AV16","v":{"v":0,"d":"0.00"}}]
[null,null,"PO Title",{"$f":"VLOOKUP(D$61,Year_Five[],3)","v":"Annual Review"},{"$f":"VLOOKUP(E$61,Year_Five[],3)","v":"GCK"},{"$f":"VLOOKUP(F$61,Year_Five[],3)","v":"Fitness & Health"},{"$f":"VLOOKUP(G$61,Year_Five[],3)","v":"Outdoor Leadership"},{"$f":"VLOOKUP(H$61,Year_Five[],3)","v":{"$error":"#N/A"}},{"$f":"VLOOKUP(I$61,Year_Five[],3)","v":"Navigation"},{"$f":"VLOOKUP(J$61,Year_Five[],3)","v":{"$error":"#N/A"}},{"$f":"VLOOKUP(K$61,Year_Five[],3)","v":{"$error":"#N/A"}},{"$f":"VLOOKUP(L$61,Year_Five[],3)","v":{"$error":"#N/A"}},{"$f":"VLOOKUP(M$61,Year_Five[],3)","v":{"$error":"#N/A"}},{"$f":"VLOOKUP(N$61,Year_Five[],3)","v":{"$error":"#N/A"}},{"$f":"VLOOKUP(O$61,Year_Five[],3)","v":"Leadership PC"},{"$f":"VLOOKUP(P$61,Year_Five[],3)","v":"Fitness & Health"},{"$f":"VLOOKUP(Q$61,Year_Five[],3)","v":"No Training"},{"$f":"VLOOKUP(R$61,Year_Five[],3)","v":"No Training"},{"$f":"VLOOKUP(S$61,Year_Five[],3)","v":"No Training"},{"$f":"VLOOKUP(T$61,Year_Five[],3)","v":{"$error":"#N/A"}},{"$f":"VLOOKUP(U$61,Year_Five[],3)","v":"Leadership PC"},{"$f":"VLOOKUP(V$61,Year_Five[],3)","v":"Sports"},{"$f":"VLOOKUP(W$61,Year_Five[],3)","v":"Leadership PC"},{"$f":"VLOOKUP(X$61,Year_Five[],3)","v":"IT PC"},{"$f":"VLOOKUP(Y$61,Year_Five[],3)","v":{"$error":"#N/A"}},{"$f":"VLOOKUP(Z$61,Year_Five[],3)","v":"Fitness & Health"},{"$f":"VLOOKUP(AA$61,Year_Five[],3)","v":{"$error":"#N/A"}},{"$f":"VLOOKUP(AB$61,Year_Five[],3)","v":"Fitness & Health"},{"$f":"VLOOKUP(AC$61,Year_Five[],3)","v":{"$error":"#N/A"}},{"$f":"VLOOKUP(AD$61,Year_Five[],3)","v":"No Training"},{"$f":"VLOOKUP(AE$61,Year_Five[],3)","v":{"$error":"#N/A"}},{"$f":"VLOOKUP(AF$61,Year_Five[],3)","v":{"$error":"#N/A"}},{"$f":"VLOOKUP(AG$61,Year_Five[],3)","v":{"$error":"#N/A"}},{"$f":"VLOOKUP(AH$61,Year_Five[],3)","v":{"$error":"#N/A"}},{"$f":"VLOOKUP(AI$61,Year_Five[],3)","v":{"$error":"#N/A"}},{"$f":"VLOOKUP(AJ$61,Year_Five[],3)","v":"Navigation"},{"$f":"VLOOKUP(AK$61,Year_Five[],3)","v":"Navigation"},{"$f":"VLOOKUP(AL$61,Year_Five[],3)","v":"No Training"},{"$f":"VLOOKUP(AM$61,Year_Five[],3)","v":"No Training"},{"$f":"VLOOKUP(AN$61,Year_Five[],3)","v":"No Training"},{"$f":"VLOOKUP(AO$61,Year_Five[],3)","v":"No Training"},{"$f":"VLOOKUP(AP$61,Year_Five[],3)","v":{"$error":"#N/A"}},{"$f":"VLOOKUP(AQ$61,Year_Five[],3)","v":{"$error":"#N/A"}},{"$f":"VLOOKUP(AR$61,Year_Five[],3)","v":{"$error":"#N/A"}},{"$f":"VLOOKUP(AS$61,Year_Five[],3)","v":{"$error":"#N/A"}},{"$f":"VLOOKUP(AT$61,Year_Five[],3)","v":{"$error":"#N/A"}},{"$f":"VLOOKUP(AU$61,Year_Five[],3)","v":{"$error":"#N/A"}},{"$f":"VLOOKUP(AV$61,Year_Five[],3)","v":{"$error":"#N/A"}}]
[null,null,"Instructor",{"$f":"VLOOKUP(D$61,Year_Five[],4)","v":{"v":0,"d":"0.00"}},{"$f":"VLOOKUP(E$61,Year_Five[],4)","v":{"v":0,"d":"0.00"}},{"$f":"VLOOKUP(F$61,Year_Five[],4)","v":{"v":0,"d":"0.00"}},{"$f":"VLOOKUP(G$61,Year_Five[],4)","v":{"v":0,"d":"0.00"}},{"$f":"VLOOKUP(H$61,Year_Five[],4)","v":{"$error":"#N/A"}},{"$f":"VLOOKUP(I$61,Year_Five[],4)","v":{"v":0,"d":"0.00"}},{"$f":"VLOOKUP(J$61,Year_Five[],4)","v":{"$error":"#N/A"}},{"$f":"VLOOKUP(K$61,Year_Five[],4)","v":{"$error":"#N/A"}},{"$f":"VLOOKUP(L$61,Year_Five[],4)","v":{"$error":"#N/A"}},{"$f":"VLOOKUP(M$61,Year_Five[],4)","v":{"$error":"#N/A"}},{"$f":"VLOOKUP(N$61,Year_Five[],4)","v":{"$error":"#N/A"}},{"$f":"VLOOKUP(O$61,Year_Five[],4)","v":{"v":0,"d":"0.00"}},{"$f":"VLOOKUP(P$61,Year_Five[],4)","v":{"v":0,"d":"0.00"}},{"$f":"VLOOKUP(Q$61,Year_Five[],4)","v":{"v":0,"d":"0.00"}},{"$f":"VLOOKUP(R$61,Year_Five[],4)","v":{"v":0,"d":"0.00"}},{"$f":"VLOOKUP(S$61,Year_Five[],4)","v":{"v":0,"d":"0.00"}},{"$f":"VLOOKUP(T$61,Year_Five[],4)","v":{"$error":"#N/A"}},{"$f":"VLOOKUP(U$61,Year_Five[],4)","v":{"v":0,"d":"0.00"}},{"$f":"VLOOKUP(V$61,Year_Five[],4)","v":{"v":0,"d":"0.00"}},{"$f":"VLOOKUP(W$61,Year_Five[],4)","v":{"v":0,"d":"0.00"}},{"$f":"VLOOKUP(X$61,Year_Five[],4)","v":{"v":0,"d":"0.00"}},{"$f":"VLOOKUP(Y$61,Year_Five[],4)","v":{"$error":"#N/A"}},{"$f":"VLOOKUP(Z$61,Year_Five[],4)","v":{"v":0,"d":"0.00"}},{"$f":"VLOOKUP(AA$61,Year_Five[],4)","v":{"$error":"#N/A"}},{"$f":"VLOOKUP(AB$61,Year_Five[],4)","v":{"v":0,"d":"0.00"}},{"$f":"VLOOKUP(AC$61,Year_Five[],4)","v":{"$error":"#N/A"}},{"$f":"VLOOKUP(AD$61,Year_Five[],4)","v":{"v":0,"d":"0.00"}},{"$f":"VLOOKUP(AE$61,Year_Five[],4)","v":{"$error":"#N/A"}},{"$f":"VLOOKUP(AF$61,Year_Five[],4)","v":{"$error":"#N/A"}},{"$f":"VLOOKUP(AG$61,Year_Five[],4)","v":{"$error":"#N/A"}},{"$f":"VLOOKUP(AH$61,Year_Five[],4)","v":{"$error":"#N/A"}},{"$f":"VLOOKUP(AI$61,Year_Five[],4)","v":{"$error":"#N/A"}},{"$f":"VLOOKUP(AJ$61,Year_Five[],4)","v":{"v":0,"d":"0.00"}},{"$f":"VLOOKUP(AK$61,Year_Five[],4)","v":{"v":0,"d":"0.00"}},{"$f":"VLOOKUP(AL$61,Year_Five[],4)","v":{"v":0,"d":"0.00"}},{"$f":"VLOOKUP(AM$61,Year_Five[],4)","v":{"v":0,"d":"0.00"}},{"$f":"VLOOKUP(AN$61,Year_Five[],4)","v":{"v":0,"d":"0.00"}},{"$f":"VLOOKUP(AO$61,Year_Five[],4)","v":{"v":0,"d":"0.00"}},{"$f":"VLOOKUP(AP$61,Year_Five[],4)","v":{"$error":"#N/A"}},{"$f":"VLOOKUP(AQ$61,Year_Five[],4)","v":{"$error":"#N/A"}},{"$f":"VLOOKUP(AR$61,Year_Five[],4)","v":{"$error":"#N/A"}},{"$f":"VLOOKUP(AS$61,Year_Five[],4)","v":{"$error":"#N/A"}},{"$f":"VLOOKUP(AT$61,Year_Five[],4)","v":{"$error":"#N/A"}},{"$f":"VLOOKUP(AU$61,Year_Five[],4)","v":{"$error":"#N/A"}},{"$f":"VLOOKUP(AV$61,Year_Five[],4)","v":{"$error":"#N/A"}}]
[null,null,"Location",{"$f":"VLOOKUP(D$61,Year_Five[],5)","v":{"v":0,"d":"0.00"}},{"$f":"VLOOKUP(E$61,Year_Five[],5)","v":{"v":0,"d":"0.00"}},{"$f":"VLOOKUP(F$61,Year_Five[],5)","v":{"v":0,"d":"0.00"}},{"$f":"VLOOKUP(G$61,Year_Five[],5)","v":{"v":0,"d":"0.00"}},{"$f":"VLOOKUP(H$61,Year_Five[],5)","v":{"$error":"#N/A"}},{"$f":"VLOOKUP(I$61,Year_Five[],5)","v":{"v":0,"d":"0.00"}},{"$f":"VLOOKUP(J$61,Year_Five[],5)","v":{"$error":"#N/A"}},{"$f":"VLOOKUP(K$61,Year_Five[],5)","v":{"$error":"#N/A"}},{"$f":"VLOOKUP(L$61,Year_Five[],5)","v":{"$error":"#N/A"}},{"$f":"VLOOKUP(M$61,Year_Five[],5)","v":{"$error":"#N/A"}},{"$f":"VLOOKUP(N$61,Year_Five[],5)","v":{"$error":"#N/A"}},{"$f":"VLOOKUP(O$61,Year_Five[],5)","v":{"v":0,"d":"0.00"}},{"$f":"VLOOKUP(P$61,Year_Five[],5)","v":{"v":0,"d":"0.00"}},{"$f":"VLOOKUP(Q$61,Year_Five[],5)","v":{"v":0,"d":"0.00"}},{"$f":"VLOOKUP(R$61,Year_Five[],5)","v":{"v":0,"d":"0.00"}},{"$f":"VLOOKUP(S$61,Year_Five[],5)","v":{"v":0,"d":"0.00"}},{"$f":"VLOOKUP(T$61,Year_Five[],5)","v":{"$error":"#N/A"}},{"$f":"VLOOKUP(U$61,Year_Five[],5)","v":{"v":0,"d":"0.00"}},{"$f":"VLOOKUP(V$61,Year_Five[],5)","v":{"v":0,"d":"0.00"}},{"$f":"VLOOKUP(W$61,Year_Five[],5)","v":{"v":0,"d":"0.00"}},{"$f":"VLOOKUP(X$61,Year_Five[],5)","v":{"v":0,"d":"0.00"}},{"$f":"VLOOKUP(Y$61,Year_Five[],5)","v":{"$error":"#N/A"}},{"$f":"VLOOKUP(Z$61,Year_Five[],5)","v":{"v":0,"d":"0.00"}},{"$f":"VLOOKUP(AA$61,Year_Five[],5)","v":{"$error":"#N/A"}},{"$f":"VLOOKUP(AB$61,Year_Five[],5)","v":{"v":0,"d":"0.00"}},{"$f":"VLOOKUP(AC$61,Year_Five[],5)","v":{"$error":"#N/A"}},{"$f":"VLOOKUP(AD$61,Year_Five[],5)","v":{"v":0,"d":"0.00"}},{"$f":"VLOOKUP(AE$61,Year_Five[],5)","v":{"$error":"#N/A"}},{"$f":"VLOOKUP(AF$61,Year_Five[],5)","v":{"$error":"#N/A"}},{"$f":"VLOOKUP(AG$61,Year_Five[],5)","v":{"$error":"#N/A"}},{"$f":"VLOOKUP(AH$61,Year_Five[],5)","v":{"$error":"#N/A"}},{"$f":"VLOOKUP(AI$61,Year_Five[],5)","v":{"$error":"#N/A"}},{"$f":"VLOOKUP(AJ$61,Year_Five[],5)","v":{"v":0,"d":"0.00"}},{"$f":"VLOOKUP(AK$61,Year_Five[],5)","v":{"v":0,"d":"0.00"}},{"$f":"VLOOKUP(AL$61,Year_Five[],5)","v":{"v":0,"d":"0.00"}},{"$f":"VLOOKUP(AM$61,Year_Five[],5)","v":{"v":0,"d":"0.00"}},{"$f":"VLOOKUP(AN$61,Year_Five[],5)","v":{"v":0,"d":"0.00"}},{"$f":"VLOOKUP(AO$61,Year_Five[],5)","v":{"v":0,"d":"0.00"}},{"$f":"VLOOKUP(AP$61,Year_Five[],5)","v":{"$error":"#N/A"}},{"$f":"VLOOKUP(AQ$61,Year_Five[],5)","v":{"$error":"#N/A"}},{"$f":"VLOOKUP(AR$61,Year_Five[],5)","v":{"$error":"#N/A"}},{"$f":"VLOOKUP(AS$61,Year_Five[],5)","v":{"$error":"#N/A"}},{"$f":"VLOOKUP(AT$61,Year_Five[],5)","v":{"$error":"#N/A"}},{"$f":"VLOOKUP(AU$61,Year_Five[],5)","v":{"$error":"#N/A"}},{"$f":"VLOOKUP(AV$61,Year_Five[],5)","v":{"$error":"#N/A"}}]
[{"$nulls":3},0,0,0,0,0,0,0,0,0,0,0,0,0,0,0,0,0,0,0,0,0,0,0,0,0,0,0,0,0,0,0,0,0,0,0,0,0,0,0,0,0,0,0,0,0]
["Dress",null,"CAF Mbrs:",{"$f":"'Master PO Schedule'!D18","v":"CadPat"},{"$f":"'Master PO Schedule'!E18","v":"CadPat"},{"$f":"'Master PO Schedule'!F18","v":"Sports"},{"$f":"'Master PO Schedule'!G18","v":"3C"},{"$f":"'Master PO Schedule'!H18","v":"CadPat"},{"$f":"'Master PO Schedule'!I18","v":"CadPat"},{"$f":"'Master PO Schedule'!J18","v":"CadPat"},{"$f":"'Master PO Schedule'!K18","v":"CadPat"},{"$f":"'Master PO Schedule'!L18","v":"3C"},{"$f":"'Master PO Schedule'!M18","v":"CadPat"},{"$f":"'Master PO Schedule'!N18","v":"CadPat"},{"$f":"'Master PO Schedule'!O18","v":"3C"},{"$f":"'Master PO Schedule'!P18","v":"Sports"},{"$f":"'Master PO Schedule'!Q18","v":0},{"$f":"'Master PO Schedule'!R18","v":0},{"$f":"'Master PO Schedule'!S18","v":0},{"$f":"'Master PO Schedule'!T18","v":"CadPat"},{"$f":"'Master PO Schedule'!U18","v":"CadPat"},{"$f":"'Master PO Schedule'!V18","v":"CadPat"},{"$f":"'Master PO Schedule'!W18","v":0},{"$f":"'Master PO Schedule'!X18","v":"CadPat"},{"$f":"'Master PO Schedule'!Y18","v":"3C"},{"$f":"'Master PO Schedule'!Z18","v":"Sports"},{"$f":"'Master PO Schedule'!AA18","v":"CadPat"},{"$f":"'Master PO Schedule'!AB18","v":"Sports"},{"$f":"'Master PO Schedule'!AC18","v":"3C"},{"$f":"'Master PO Schedule'!AD18","v":0},{"$f":"'Master PO Schedule'!AE18","v":"1A"},{"$f":"'Master PO Schedule'!AF18","v":"CadPat"},{"$f":"'Master PO Schedule'!AG18","v":"CadPat"},{"$f":"'Master PO Schedule'!AH18","v":"CadPat"},{"$f":"'Master PO Schedule'!AI18","v":"3C"},{"$f":"'Master PO Schedule'!AJ18","v":"CadPat"},{"$f":"'Master PO Schedule'!AK18","v":"CadPat"},{"$f":"'Master PO Schedule'!AL18","v":"CadPat"},{"$f":"'Master PO Schedule'!AM18","v":"3C"},{"$f":"'Master PO Schedule'!AN18","v":"3C"},{"$f":"'Master PO Schedule'!AO18","v":"3C"},{"$f":"'Master PO Schedule'!AP18","v":0},{"$f":"'Master PO Schedule'!AQ18","v":0},{"$f":"'Master PO Schedule'!AR18","v":0},{"$f":"'Master PO Schedule'!AS18","v":0},{"$f":"'Master PO Schedule'!AT18","v":0},{"$f":"'Master PO Schedule'!AU18","v":0},{"$f":"'Master PO Schedule'!AV18","v":0}]
[null,null,"Cadets:",{"$f":"'Master PO Schedule'!D19","v":"FTU"},{"$f":"'Master PO Schedule'!E19","v":"FTU"},{"$f":"'Master PO Schedule'!F19","v":"Sports"},{"$f":"'Master PO Schedule'!G19","v":"C-2"},{"$f":"'Master PO Schedule'!H19","v":"FTU"},{"$f":"'Master PO Schedule'!I19","v":"FTU"},{"$f":"'Master PO Schedule'!J19","v":"FTU"},{"$f":"'Master PO Schedule'!K19","v":"FTU"},{"$f":"'Master PO Schedule'!L19","v":"C-2"},{"$f":"'Master PO Schedule'!M19","v":"FTU"},{"$f":"'Master PO Schedule'!N19","v":"FTU"},{"$f":"'Master PO Schedule'!O19","v":"C-2"},{"$f":"'Master PO Schedule'!P19","v":"Sports"},{"$f":"'Master PO Schedule'!Q19","v":0},{"$f":"'Master PO Schedule'!R19","v":0},{"$f":"'Master PO Schedule'!S19","v":0},{"$f":"'Master PO Schedule'!T19","v":"FTU"},{"$f":"'Master PO Schedule'!U19","v":"FTU"},{"$f":"'Master PO Schedule'!V19","v":"FTU"},{"$f":"'Master PO Schedule'!W19","v":0},{"$f":"'Master PO Schedule'!X19","v":"FTU"},{"$f":"'Master PO Schedule'!Y19","v":"C-2"},{"$f":"'Master PO Schedule'!Z19","v":"Sports"},{"$f":"'Master PO Schedule'!AA19","v":"FTU"},{"$f":"'Master PO Schedule'!AB19","v":"Sports"},{"$f":"'Master PO Schedule'!AC19","v":"C-2"},{"$f":"'Master PO Schedule'!AD19","v":0},{"$f":"'Master PO Schedule'!AE19","v":"C-1"},{"$f":"'Master PO Schedule'!AF19","v":"FTU"},{"$f":"'Master PO Schedule'!AG19","v":"FTU"},{"$f":"'Master PO Schedule'!AH19","v":"FTU"},{"$f":"'Master PO Schedule'!AI19","v":"C-2"},{"$f":"'Master PO Schedule'!AJ19","v":"FTU"},{"$f":"'Master PO Schedule'!AK19","v":"FTU"},{"$f":"'Master PO Schedule'!AL19","v":"FTU"},{"$f":"'Master PO Schedule'!AM19","v":"C-3"},{"$f":"'Master PO Schedule'!AN19","v":"C-3"},{"$f":"'Master PO Schedule'!AO19","v":"C-3"},{"$f":"'Master PO Schedule'!AP19","v":0},{"$f":"'Master PO Schedule'!AQ19","v":0},{"$f":"'Master PO Schedule'!AR19","v":0},{"$f":"'Master PO Schedule'!AS19","v":0},{"$f":"'Master PO Schedule'!AT19","v":0},{"$f":"'Master PO Schedule'!AU19","v":0},{"$f":"'Master PO Schedule'!AV19","v":0}]
[]
[{"$nulls":3},0]
[]
[]
[]
[{"$nulls":3},0]
[]
[]
[]
[{"$nulls":3},0]
[]
[]
[]
[{"$nulls":3},0]
[]
[]
[]
[{"$nulls":3},0]
[]
[]
[]
[{"$nulls":3},0]
[]
[]
[]
[{"$nulls":3},0]
[]
[]
[]
[{"$nulls":3},0]
[]
[]
[]
[{"$nulls":3},0]
[]
[]
[]
[{"$nulls":3},0]
[]
[]
[]
[{"$nulls":3},0]
[]
[]
[]
[{"$nulls":3},0]
[]
[]
[]
[{"$nulls":3},0]
[]
[]
[]
[{"$nulls":3},0]
[]
[]
[]
[{"$nulls":3},0]
[]
[]
[]
[{"$nulls":3},0]
[]
[]
[]
[{"$nulls":3},0]

{"sheet":"Weekly Trg","index":4,"n_rows":102,"n_cols":14,"rows_kept":102}
["This table is for listing recurring weekly training / events such as Admin nights, Sports, Band, Drill Team, etc."]
["It works best in Routine Order if this list is sorted first by \"Start Time\" and then sorted by \"Sort Order\" column to right."]
["Beginning (first occurrence in d mmm yy)","Ending       (final occurrence in d mmm yy)","Day (Auto-fills)","Start Time (HH:mm)","End Time (HH:mm)","Activity","Column1","Column2","Location","Column3","Dress","OPI","Sort Order","Sort Calculation"]
["2019-09-16","2020-02-10",{"$f":"IF(ISBLANK(A4),\"\",TEXT(A4,\"DDD\"))","v":"Mon"},"16:00:00","18:30:00","Marksmanship Team Practice",null,null,"MDVA",null,"Civvies","Capt. Carlsen",{"$f":"IF(ISBLANK(Table1[[#This Row],[Beginning (first occurrence in d mmm yy)]]),\"\",N4)","v":4},{"$f":"IF(ISBLANK('Weekly Trg'!A4),8,IF(WEEKDAY('Weekly Trg'!A4,1)>WEEKDAY('Unit Info'!$B$14,1),WEEKDAY('Weekly Trg'!A4,1)-WEEKDAY('Unit Info'!$B$14,1),WEEKDAY('Weekly Trg'!A4,1)+7-WEEKDAY('Unit Info'!$B$14,1)))","v":4}]
["2020-03-30","2020-05-25","Mon","16:00:00","18:30:00","Drill Practice",null,null,"MDVA",null,"Civvies","Capt. Carlsen",{"$f":"IF(ISBLANK(Table1[[#This Row],[Beginning (first occurrence in d mmm yy)]]),\"\",N5)","v":4},{"$f":"IF(ISBLANK('Weekly Trg'!A5),8,IF(WEEKDAY('Weekly Trg'!A5,1)>WEEKDAY('Unit Info'!$B$14,1),WEEKDAY('Weekly Trg'!A5,1)-WEEKDAY('Unit Info'!$B$14,1),WEEKDAY('Weekly Trg'!A5,1)+7-WEEKDAY('Unit Info'!$B$14,1)))","v":4}]
[null,null,"",{"$nulls":9},{"$f":"IF(ISBLANK(Table1[[#This Row],[Beginning (first occurrence in d mmm yy)]]),\"\",N6)","v":""},{"$f":"IF(ISBLANK('Weekly Trg'!A6),8,IF(WEEKDAY('Weekly Trg'!A6,1)>WEEKDAY('Unit Info'!$B$14,1),WEEKDAY('Weekly Trg'!A6,1)-WEEKDAY('Unit Info'!$B$14,1),WEEKDAY('Weekly Trg'!A6,1)+7-WEEKDAY('Unit Info'!$B$14,1)))","v":8}]
[null,null,"",{"$nulls":9},{"$f":"IF(ISBLANK(Table1[[#This Row],[Beginning (first occurrence in d mmm yy)]]),\"\",N7)","v":""},{"$f":"IF(ISBLANK('Weekly Trg'!A7),8,IF(WEEKDAY('Weekly Trg'!A7,1)>WEEKDAY('Unit Info'!$B$14,1),WEEKDAY('Weekly Trg'!A7,1)-WEEKDAY('Unit Info'!$B$14,1),WEEKDAY('Weekly Trg'!A7,1)+7-WEEKDAY('Unit Info'!$B$14,1)))","v":8}]
[null,null,"",{"$nulls":9},{"$f":"IF(ISBLANK(Table1[[#This Row],[Beginning (first occurrence in d mmm yy)]]),\"\",N8)","v":""},{"$f":"IF(ISBLANK('Weekly Trg'!A8),8,IF(WEEKDAY('Weekly Trg'!A8,1)>WEEKDAY('Unit Info'!$B$14,1),WEEKDAY('Weekly Trg'!A8,1)-WEEKDAY('Unit Info'!$B$14,1),WEEKDAY('Weekly Trg'!A8,1)+7-WEEKDAY('Unit Info'!$B$14,1)))","v":8}]
[null,null,"",{"$nulls":9},{"$f":"IF(ISBLANK(Table1[[#This Row],[Beginning (first occurrence in d mmm yy)]]),\"\",N9)","v":""},{"$f":"IF(ISBLANK('Weekly Trg'!A9),8,IF(WEEKDAY('Weekly Trg'!A9,1)>WEEKDAY('Unit Info'!$B$14,1),WEEKDAY('Weekly Trg'!A9,1)-WEEKDAY('Unit Info'!$B$14,1),WEEKDAY('Weekly Trg'!A9,1)+7-WEEKDAY('Unit Info'!$B$14,1)))","v":8}]
[null,null,"",{"$nulls":9},{"$f":"IF(ISBLANK(Table1[[#This Row],[Beginning (first occurrence in d mmm yy)]]),\"\",N10)","v":""},{"$f":"IF(ISBLANK('Weekly Trg'!A10),8,IF(WEEKDAY('Weekly Trg'!A10,1)>WEEKDAY('Unit Info'!$B$14,1),WEEKDAY('Weekly Trg'!A10,1)-WEEKDAY('Unit Info'!$B$14,1),WEEKDAY('Weekly Trg'!A10,1)+7-WEEKDAY('Unit Info'!$B$14,1)))","v":8}]
[null,null,"",{"$nulls":9},{"$f":"IF(ISBLANK(Table1[[#This Row],[Beginning (first occurrence in d mmm yy)]]),\"\",N11)","v":""},{"$f":"IF(ISBLANK('Weekly Trg'!A11),8,IF(WEEKDAY('Weekly Trg'!A11,1)>WEEKDAY('Unit Info'!$B$14,1),WEEKDAY('Weekly Trg'!A11,1)-WEEKDAY('Unit Info'!$B$14,1),WEEKDAY('Weekly Trg'!A11,1)+7-WEEKDAY('Unit Info'!$B$14,1)))","v":8}]
[null,null,"",{"$nulls":9},{"$f":"IF(ISBLANK(Table1[[#This Row],[Beginning (first occurrence in d mmm yy)]]),\"\",N12)","v":""},{"$f":"IF(ISBLANK('Weekly Trg'!A12),8,IF(WEEKDAY('Weekly Trg'!A12,1)>WEEKDAY('Unit Info'!$B$14,1),WEEKDAY('Weekly Trg'!A12,1)-WEEKDAY('Unit Info'!$B$14,1),WEEKDAY('Weekly Trg'!A12,1)+7-WEEKDAY('Unit Info'!$B$14,1)))","v":8}]
[null,null,"",{"$nulls":9},{"$f":"IF(ISBLANK(Table1[[#This Row],[Beginning (first occurrence in d mmm yy)]]),\"\",N13)","v":""},{"$f":"IF(ISBLANK('Weekly Trg'!A13),8,IF(WEEKDAY('Weekly Trg'!A13,1)>WEEKDAY('Unit Info'!$B$14,1),WEEKDAY('Weekly Trg'!A13,1)-WEEKDAY('Unit Info'!$B$14,1),WEEKDAY('Weekly Trg'!A13,1)+7-WEEKDAY('Unit Info'!$B$14,1)))","v":8}]
[null,null,"",{"$nulls":9},{"$f":"IF(ISBLANK(Table1[[#This Row],[Beginning (first occurrence in d mmm yy)]]),\"\",N14)","v":""},{"$f":"IF(ISBLANK('Weekly Trg'!A14),8,IF(WEEKDAY('Weekly Trg'!A14,1)>WEEKDAY('Unit Info'!$B$14,1),WEEKDAY('Weekly Trg'!A14,1)-WEEKDAY('Unit Info'!$B$14,1),WEEKDAY('Weekly Trg'!A14,1)+7-WEEKDAY('Unit Info'!$B$14,1)))","v":8}]
[null,null,"",{"$nulls":9},{"$f":"IF(ISBLANK(Table1[[#This Row],[Beginning (first occurrence in d mmm yy)]]),\"\",N15)","v":""},{"$f":"IF(ISBLANK('Weekly Trg'!A15),8,IF(WEEKDAY('Weekly Trg'!A15,1)>WEEKDAY('Unit Info'!$B$14,1),WEEKDAY('Weekly Trg'!A15,1)-WEEKDAY('Unit Info'!$B$14,1),WEEKDAY('Weekly Trg'!A15,1)+7-WEEKDAY('Unit Info'!$B$14,1)))","v":8}]
[null,null,"",{"$nulls":9},{"$f":"IF(ISBLANK(Table1[[#This Row],[Beginning (first occurrence in d mmm yy)]]),\"\",N16)","v":""},{"$f":"IF(ISBLANK('Weekly Trg'!A16),8,IF(WEEKDAY('Weekly Trg'!A16,1)>WEEKDAY('Unit Info'!$B$14,1),WEEKDAY('Weekly Trg'!A16,1)-WEEKDAY('Unit Info'!$B$14,1),WEEKDAY('Weekly Trg'!A16,1)+7-WEEKDAY('Unit Info'!$B$14,1)))","v":8}]
[null,null,"",{"$nulls":9},{"$f":"IF(ISBLANK(Table1[[#This Row],[Beginning (first occurrence in d mmm yy)]]),\"\",N17)","v":""},{"$f":"IF(ISBLANK('Weekly Trg'!A17),8,IF(WEEKDAY('Weekly Trg'!A17,1)>WEEKDAY('Unit Info'!$B$14,1),WEEKDAY('Weekly Trg'!A17,1)-WEEKDAY('Unit Info'!$B$14,1),WEEKDAY('Weekly Trg'!A17,1)+7-WEEKDAY('Unit Info'!$B$14,1)))","v":8}]
[null,null,"",{"$nulls":9},{"$f":"IF(ISBLANK(Table1[[#This Row],[Beginning (first occurrence in d mmm yy)]]),\"\",N18)","v":""},{"$f":"IF(ISBLANK('Weekly Trg'!A18),8,IF(WEEKDAY('Weekly Trg'!A18,1)>WEEKDAY('Unit Info'!$B$14,1),WEEKDAY('Weekly Trg'!A18,1)-WEEKDAY('Unit Info'!$B$14,1),WEEKDAY('Weekly Trg'!A18,1)+7-WEEKDAY('Unit Info'!$B$14,1)))","v":8}]
[null,null,"",{"$nulls":9},{"$f":"IF(ISBLANK(Table1[[#This Row],[Beginning (first occurrence in d mmm yy)]]),\"\",N19)","v":""},{"$f":"IF(ISBLANK('Weekly Trg'!A19),8,IF(WEEKDAY('Weekly Trg'!A19,1)>WEEKDAY('Unit Info'!$B$14,1),WEEKDAY('Weekly Trg'!A19,1)-WEEKDAY('Unit Info'!$B$14,1),WEEKDAY('Weekly Trg'!A19,1)+7-WEEKDAY('Unit Info'!$B$14,1)))","v":8}]
[null,null,"",{"$nulls":9},{"$f":"IF(ISBLANK(Table1[[#This Row],[Beginning (first occurrence in d mmm yy)]]),\"\",N20)","v":""},{"$f":"IF(ISBLANK('Weekly Trg'!A20),8,IF(WEEKDAY('Weekly Trg'!A20,1)>WEEKDAY('Unit Info'!$B$14,1),WEEKDAY('Weekly Trg'!A20,1)-WEEKDAY('Unit Info'!$B$14,1),WEEKDAY('Weekly Trg'!A20,1)+7-WEEKDAY('Unit Info'!$B$14,1)))","v":8}]
[null,null,"",{"$nulls":9},{"$f":"IF(ISBLANK(Table1[[#This Row],[Beginning (first occurrence in d mmm yy)]]),\"\",N21)","v":""},{"$f":"IF(ISBLANK('Weekly Trg'!A21),8,IF(WEEKDAY('Weekly Trg'!A21,1)>WEEKDAY('Unit Info'!$B$14,1),WEEKDAY('Weekly Trg'!A21,1)-WEEKDAY('Unit Info'!$B$14,1),WEEKDAY('Weekly Trg'!A21,1)+7-WEEKDAY('Unit Info'!$B$14,1)))","v":8}]
[null,null,"",{"$nulls":9},{"$f":"IF(ISBLANK(Table1[[#This Row],[Beginning (first occurrence in d mmm yy)]]),\"\",N22)","v":""},{"$f":"IF(ISBLANK('Weekly Trg'!A22),8,IF(WEEKDAY('Weekly Trg'!A22,1)>WEEKDAY('Unit Info'!$B$14,1),WEEKDAY('Weekly Trg'!A22,1)-WEEKDAY('Unit Info'!$B$14,1),WEEKDAY('Weekly Trg'!A22,1)+7-WEEKDAY('Unit Info'!$B$14,1)))","v":8}]
[null,null,"",{"$nulls":9},{"$f":"IF(ISBLANK(Table1[[#This Row],[Beginning (first occurrence in d mmm yy)]]),\"\",N23)","v":""},{"$f":"IF(ISBLANK('Weekly Trg'!A23),8,IF(WEEKDAY('Weekly Trg'!A23,1)>WEEKDAY('Unit Info'!$B$14,1),WEEKDAY('Weekly Trg'!A23,1)-WEEKDAY('Unit Info'!$B$14,1),WEEKDAY('Weekly Trg'!A23,1)+7-WEEKDAY('Unit Info'!$B$14,1)))","v":8}]
[null,null,"",{"$nulls":9},{"$f":"IF(ISBLANK(Table1[[#This Row],[Beginning (first occurrence in d mmm yy)]]),\"\",N24)","v":""},{"$f":"IF(ISBLANK('Weekly Trg'!A24),8,IF(WEEKDAY('Weekly Trg'!A24,1)>WEEKDAY('Unit Info'!$B$14,1),WEEKDAY('Weekly Trg'!A24,1)-WEEKDAY('Unit Info'!$B$14,1),WEEKDAY('Weekly Trg'!A24,1)+7-WEEKDAY('Unit Info'!$B$14,1)))","v":8}]
[null,null,"",{"$nulls":9},{"$f":"IF(ISBLANK(Table1[[#This Row],[Beginning (first occurrence in d mmm yy)]]),\"\",N25)","v":""},{"$f":"IF(ISBLANK('Weekly Trg'!A25),8,IF(WEEKDAY('Weekly Trg'!A25,1)>WEEKDAY('Unit Info'!$B$14,1),WEEKDAY('Weekly Trg'!A25,1)-WEEKDAY('Unit Info'!$B$14,1),WEEKDAY('Weekly Trg'!A25,1)+7-WEEKDAY('Unit Info'!$B$14,1)))","v":8}]
[null,null,"",{"$nulls":9},{"$f":"IF(ISBLANK(Table1[[#This Row],[Beginning (first occurrence in d mmm yy)]]),\"\",N26)","v":""},{"$f":"IF(ISBLANK('Weekly Trg'!A26),8,IF(WEEKDAY('Weekly Trg'!A26,1)>WEEKDAY('Unit Info'!$B$14,1),WEEKDAY('Weekly Trg'!A26,1)-WEEKDAY('Unit Info'!$B$14,1),WEEKDAY('Weekly Trg'!A26,1)+7-WEEKDAY('Unit Info'!$B$14,1)))","v":8}]
[null,null,"",{"$nulls":9},{"$f":"IF(ISBLANK(Table1[[#This Row],[Beginning (first occurrence in d mmm yy)]]),\"\",N27)","v":""},{"$f":"IF(ISBLANK('Weekly Trg'!A27),8,IF(WEEKDAY('Weekly Trg'!A27,1)>WEEKDAY('Unit Info'!$B$14,1),WEEKDAY('Weekly Trg'!A27,1)-WEEKDAY('Unit Info'!$B$14,1),WEEKDAY('Weekly Trg'!A27,1)+7-WEEKDAY('Unit Info'!$B$14,1)))","v":8}]
[null,null,"",{"$nulls":9},{"$f":"IF(ISBLANK(Table1[[#This Row],[Beginning (first occurrence in d mmm yy)]]),\"\",N28)","v":""},{"$f":"IF(ISBLANK('Weekly Trg'!A28),8,IF(WEEKDAY('Weekly Trg'!A28,1)>WEEKDAY('Unit Info'!$B$14,1),WEEKDAY('Weekly Trg'!A28,1)-WEEKDAY('Unit Info'!$B$14,1),WEEKDAY('Weekly Trg'!A28,1)+7-WEEKDAY('Unit Info'!$B$14,1)))","v":8}]
[null,null,"",{"$nulls":9},{"$f":"IF(ISBLANK(Table1[[#This Row],[Beginning (first occurrence in d mmm yy)]]),\"\",N29)","v":""},{"$f":"IF(ISBLANK('Weekly Trg'!A29),8,IF(WEEKDAY('Weekly Trg'!A29,1)>WEEKDAY('Unit Info'!$B$14,1),WEEKDAY('Weekly Trg'!A29,1)-WEEKDAY('Unit Info'!$B$14,1),WEEKDAY('Weekly Trg'!A29,1)+7-WEEKDAY('Unit Info'!$B$14,1)))","v":8}]
[null,null,"",{"$nulls":9},{"$f":"IF(ISBLANK(Table1[[#This Row],[Beginning (first occurrence in d mmm yy)]]),\"\",N30)","v":""},{"$f":"IF(ISBLANK('Weekly Trg'!A30),8,IF(WEEKDAY('Weekly Trg'!A30,1)>WEEKDAY('Unit Info'!$B$14,1),WEEKDAY('Weekly Trg'!A30,1)-WEEKDAY('Unit Info'!$B$14,1),WEEKDAY('Weekly Trg'!A30,1)+7-WEEKDAY('Unit Info'!$B$14,1)))","v":8}]
[null,null,"",{"$nulls":9},{"$f":"IF(ISBLANK(Table1[[#This Row],[Beginning (first occurrence in d mmm yy)]]),\"\",N31)","v":""},{"$f":"IF(ISBLANK('Weekly Trg'!A31),8,IF(WEEKDAY('Weekly Trg'!A31,1)>WEEKDAY('Unit Info'!$B$14,1),WEEKDAY('Weekly Trg'!A31,1)-WEEKDAY('Unit Info'!$B$14,1),WEEKDAY('Weekly Trg'!A31,1)+7-WEEKDAY('Unit Info'!$B$14,1)))","v":8}]
[null,null,"",{"$nulls":9},{"$f":"IF(ISBLANK(Table1[[#This Row],[Beginning (first occurrence in d mmm yy)]]),\"\",N32)","v":""},{"$f":"IF(ISBLANK('Weekly Trg'!A32),8,IF(WEEKDAY('Weekly Trg'!A32,1)>WEEKDAY('Unit Info'!$B$14,1),WEEKDAY('Weekly Trg'!A32,1)-WEEKDAY('Unit Info'!$B$14,1),WEEKDAY('Weekly Trg'!A32,1)+7-WEEKDAY('Unit Info'!$B$14,1)))","v":8}]
[null,null,"",{"$nulls":9},{"$f":"IF(ISBLANK(Table1[[#This Row],[Beginning (first occurrence in d mmm yy)]]),\"\",N33)","v":""},{"$f":"IF(ISBLANK('Weekly Trg'!A33),8,IF(WEEKDAY('Weekly Trg'!A33,1)>WEEKDAY('Unit Info'!$B$14,1),WEEKDAY('Weekly Trg'!A33,1)-WEEKDAY('Unit Info'!$B$14,1),WEEKDAY('Weekly Trg'!A33,1)+7-WEEKDAY('Unit Info'!$B$14,1)))","v":8}]
[null,null,"",{"$nulls":9},{"$f":"IF(ISBLANK(Table1[[#This Row],[Beginning (first occurrence in d mmm yy)]]),\"\",N34)","v":""},{"$f":"IF(ISBLANK('Weekly Trg'!A34),8,IF(WEEKDAY('Weekly Trg'!A34,1)>WEEKDAY('Unit Info'!$B$14,1),WEEKDAY('Weekly Trg'!A34,1)-WEEKDAY('Unit Info'!$B$14,1),WEEKDAY('Weekly Trg'!A34,1)+7-WEEKDAY('Unit Info'!$B$14,1)))","v":8}]
[null,null,"",{"$nulls":9},{"$f":"IF(ISBLANK(Table1[[#This Row],[Beginning (first occurrence in d mmm yy)]]),\"\",N35)","v":""},{"$f":"IF(ISBLANK('Weekly Trg'!A35),8,IF(WEEKDAY('Weekly Trg'!A35,1)>WEEKDAY('Unit Info'!$B$14,1),WEEKDAY('Weekly Trg'!A35,1)-WEEKDAY('Unit Info'!$B$14,1),WEEKDAY('Weekly Trg'!A35,1)+7-WEEKDAY('Unit Info'!$B$14,1)))","v":8}]
[null,null,{"$f":"IF(ISBLANK(A36),\"\",TEXT(A36,\"DDD\"))","v":""},{"$nulls":9},{"$f":"IF(ISBLANK(Table1[[#This Row],[Beginning (first occurrence in d mmm yy)]]),\"\",N36)","v":""},{"$f":"IF(ISBLANK('Weekly Trg'!A36),8,IF(WEEKDAY('Weekly Trg'!A36,1)>WEEKDAY('Unit Info'!$B$14,1),WEEKDAY('Weekly Trg'!A36,1)-WEEKDAY('Unit Info'!$B$14,1),WEEKDAY('Weekly Trg'!A36,1)+7-WEEKDAY('Unit Info'!$B$14,1)))","v":8}]
[null,null,"",{"$nulls":9},{"$f":"IF(ISBLANK(Table1[[#This Row],[Beginning (first occurrence in d mmm yy)]]),\"\",N37)","v":""},{"$f":"IF(ISBLANK('Weekly Trg'!A37),8,IF(WEEKDAY('Weekly Trg'!A37,1)>WEEKDAY('Unit Info'!$B$14,1),WEEKDAY('Weekly Trg'!A37,1)-WEEKDAY('Unit Info'!$B$14,1),WEEKDAY('Weekly Trg'!A37,1)+7-WEEKDAY('Unit Info'!$B$14,1)))","v":8}]
[null,null,"",{"$nulls":9},{"$f":"IF(ISBLANK(Table1[[#This Row],[Beginning (first occurrence in d mmm yy)]]),\"\",N38)","v":""},{"$f":"IF(ISBLANK('Weekly Trg'!A38),8,IF(WEEKDAY('Weekly Trg'!A38,1)>WEEKDAY('Unit Info'!$B$14,1),WEEKDAY('Weekly Trg'!A38,1)-WEEKDAY('Unit Info'!$B$14,1),WEEKDAY('Weekly Trg'!A38,1)+7-WEEKDAY('Unit Info'!$B$14,1)))","v":8}]
[null,null,"",{"$nulls":9},{"$f":"IF(ISBLANK(Table1[[#This Row],[Beginning (first occurrence in d mmm yy)]]),\"\",N39)","v":""},{"$f":"IF(ISBLANK('Weekly Trg'!A39),8,IF(WEEKDAY('Weekly Trg'!A39,1)>WEEKDAY('Unit Info'!$B$14,1),WEEKDAY('Weekly Trg'!A39,1)-WEEKDAY('Unit Info'!$B$14,1),WEEKDAY('Weekly Trg'!A39,1)+7-WEEKDAY('Unit Info'!$B$14,1)))","v":8}]
[null,null,"",{"$nulls":9},{"$f":"IF(ISBLANK(Table1[[#This Row],[Beginning (first occurrence in d mmm yy)]]),\"\",N40)","v":""},{"$f":"IF(ISBLANK('Weekly Trg'!A40),8,IF(WEEKDAY('Weekly Trg'!A40,1)>WEEKDAY('Unit Info'!$B$14,1),WEEKDAY('Weekly Trg'!A40,1)-WEEKDAY('Unit Info'!$B$14,1),WEEKDAY('Weekly Trg'!A40,1)+7-WEEKDAY('Unit Info'!$B$14,1)))","v":8}]
[null,null,"",{"$nulls":9},{"$f":"IF(ISBLANK(Table1[[#This Row],[Beginning (first occurrence in d mmm yy)]]),\"\",N41)","v":""},{"$f":"IF(ISBLANK('Weekly Trg'!A41),8,IF(WEEKDAY('Weekly Trg'!A41,1)>WEEKDAY('Unit Info'!$B$14,1),WEEKDAY('Weekly Trg'!A41,1)-WEEKDAY('Unit Info'!$B$14,1),WEEKDAY('Weekly Trg'!A41,1)+7-WEEKDAY('Unit Info'!$B$14,1)))","v":8}]
[null,null,"",{"$nulls":9},{"$f":"IF(ISBLANK(Table1[[#This Row],[Beginning (first occurrence in d mmm yy)]]),\"\",N42)","v":""},{"$f":"IF(ISBLANK('Weekly Trg'!A42),8,IF(WEEKDAY('Weekly Trg'!A42,1)>WEEKDAY('Unit Info'!$B$14,1),WEEKDAY('Weekly Trg'!A42,1)-WEEKDAY('Unit Info'!$B$14,1),WEEKDAY('Weekly Trg'!A42,1)+7-WEEKDAY('Unit Info'!$B$14,1)))","v":8}]
[null,null,"",{"$nulls":9},{"$f":"IF(ISBLANK(Table1[[#This Row],[Beginning (first occurrence in d mmm yy)]]),\"\",N43)","v":""},{"$f":"IF(ISBLANK('Weekly Trg'!A43),8,IF(WEEKDAY('Weekly Trg'!A43,1)>WEEKDAY('Unit Info'!$B$14,1),WEEKDAY('Weekly Trg'!A43,1)-WEEKDAY('Unit Info'!$B$14,1),WEEKDAY('Weekly Trg'!A43,1)+7-WEEKDAY('Unit Info'!$B$14,1)))","v":8}]
[null,null,"",{"$nulls":9},{"$f":"IF(ISBLANK(Table1[[#This Row],[Beginning (first occurrence in d mmm yy)]]),\"\",N44)","v":""},{"$f":"IF(ISBLANK('Weekly Trg'!A44),8,IF(WEEKDAY('Weekly Trg'!A44,1)>WEEKDAY('Unit Info'!$B$14,1),WEEKDAY('Weekly Trg'!A44,1)-WEEKDAY('Unit Info'!$B$14,1),WEEKDAY('Weekly Trg'!A44,1)+7-WEEKDAY('Unit Info'!$B$14,1)))","v":8}]
[null,null,"",{"$nulls":9},{"$f":"IF(ISBLANK(Table1[[#This Row],[Beginning (first occurrence in d mmm yy)]]),\"\",N45)","v":""},{"$f":"IF(ISBLANK('Weekly Trg'!A45),8,IF(WEEKDAY('Weekly Trg'!A45,1)>WEEKDAY('Unit Info'!$B$14,1),WEEKDAY('Weekly Trg'!A45,1)-WEEKDAY('Unit Info'!$B$14,1),WEEKDAY('Weekly Trg'!A45,1)+7-WEEKDAY('Unit Info'!$B$14,1)))","v":8}]
[null,null,"",{"$nulls":9},{"$f":"IF(ISBLANK(Table1[[#This Row],[Beginning (first occurrence in d mmm yy)]]),\"\",N46)","v":""},{"$f":"IF(ISBLANK('Weekly Trg'!A46),8,IF(WEEKDAY('Weekly Trg'!A46,1)>WEEKDAY('Unit Info'!$B$14,1),WEEKDAY('Weekly Trg'!A46,1)-WEEKDAY('Unit Info'!$B$14,1),WEEKDAY('Weekly Trg'!A46,1)+7-WEEKDAY('Unit Info'!$B$14,1)))","v":8}]
[null,null,"",{"$nulls":9},{"$f":"IF(ISBLANK(Table1[[#This Row],[Beginning (first occurrence in d mmm yy)]]),\"\",N47)","v":""},{"$f":"IF(ISBLANK('Weekly Trg'!A47),8,IF(WEEKDAY('Weekly Trg'!A47,1)>WEEKDAY('Unit Info'!$B$14,1),WEEKDAY('Weekly Trg'!A47,1)-WEEKDAY('Unit Info'!$B$14,1),WEEKDAY('Weekly Trg'!A47,1)+7-WEEKDAY('Unit Info'!$B$14,1)))","v":8}]
[null,null,"",{"$nulls":9},{"$f":"IF(ISBLANK(Table1[[#This Row],[Beginning (first occurrence in d mmm yy)]]),\"\",N48)","v":""},{"$f":"IF(ISBLANK('Weekly Trg'!A48),8,IF(WEEKDAY('Weekly Trg'!A48,1)>WEEKDAY('Unit Info'!$B$14,1),WEEKDAY('Weekly Trg'!A48,1)-WEEKDAY('Unit Info'!$B$14,1),WEEKDAY('Weekly Trg'!A48,1)+7-WEEKDAY('Unit Info'!$B$14,1)))","v":8}]
[null,null,"",{"$nulls":9},{"$f":"IF(ISBLANK(Table1[[#This Row],[Beginning (first occurrence in d mmm yy)]]),\"\",N49)","v":""},{"$f":"IF(ISBLANK('Weekly Trg'!A49),8,IF(WEEKDAY('Weekly Trg'!A49,1)>WEEKDAY('Unit Info'!$B$14,1),WEEKDAY('Weekly Trg'!A49,1)-WEEKDAY('Unit Info'!$B$14,1),WEEKDAY('Weekly Trg'!A49,1)+7-WEEKDAY('Unit Info'!$B$14,1)))","v":8}]
[null,null,"",{"$nulls":9},{"$f":"IF(ISBLANK(Table1[[#This Row],[Beginning (first occurrence in d mmm yy)]]),\"\",N50)","v":""},{"$f":"IF(ISBLANK('Weekly Trg'!A50),8,IF(WEEKDAY('Weekly Trg'!A50,1)>WEEKDAY('Unit Info'!$B$14,1),WEEKDAY('Weekly Trg'!A50,1)-WEEKDAY('Unit Info'!$B$14,1),WEEKDAY('Weekly Trg'!A50,1)+7-WEEKDAY('Unit Info'!$B$14,1)))","v":8}]
[null,null,"",{"$nulls":9},{"$f":"IF(ISBLANK(Table1[[#This Row],[Beginning (first occurrence in d mmm yy)]]),\"\",N51)","v":""},{"$f":"IF(ISBLANK('Weekly Trg'!A51),8,IF(WEEKDAY('Weekly Trg'!A51,1)>WEEKDAY('Unit Info'!$B$14,1),WEEKDAY('Weekly Trg'!A51,1)-WEEKDAY('Unit Info'!$B$14,1),WEEKDAY('Weekly Trg'!A51,1)+7-WEEKDAY('Unit Info'!$B$14,1)))","v":8}]
[null,null,"",{"$nulls":9},{"$f":"IF(ISBLANK(Table1[[#This Row],[Beginning (first occurrence in d mmm yy)]]),\"\",N52)","v":""},{"$f":"IF(ISBLANK('Weekly Trg'!A52),8,IF(WEEKDAY('Weekly Trg'!A52,1)>WEEKDAY('Unit Info'!$B$14,1),WEEKDAY('Weekly Trg'!A52,1)-WEEKDAY('Unit Info'!$B$14,1),WEEKDAY('Weekly Trg'!A52,1)+7-WEEKDAY('Unit Info'!$B$14,1)))","v":8}]
[null,null,"",{"$nulls":9},{"$f":"IF(ISBLANK(Table1[[#This Row],[Beginning (first occurrence in d mmm yy)]]),\"\",N53)","v":""},{"$f":"IF(ISBLANK('Weekly Trg'!A53),8,IF(WEEKDAY('Weekly Trg'!A53,1)>WEEKDAY('Unit Info'!$B$14,1),WEEKDAY('Weekly Trg'!A53,1)-WEEKDAY('Unit Info'!$B$14,1),WEEKDAY('Weekly Trg'!A53,1)+7-WEEKDAY('Unit Info'!$B$14,1)))","v":8}]
[null,null,"",{"$nulls":9},{"$f":"IF(ISBLANK(Table1[[#This Row],[Beginning (first occurrence in d mmm yy)]]),\"\",N54)","v":""},{"$f":"IF(ISBLANK('Weekly Trg'!A54),8,IF(WEEKDAY('Weekly Trg'!A54,1)>WEEKDAY('Unit Info'!$B$14,1),WEEKDAY('Weekly Trg'!A54,1)-WEEKDAY('Unit Info'!$B$14,1),WEEKDAY('Weekly Trg'!A54,1)+7-WEEKDAY('Unit Info'!$B$14,1)))","v":8}]
[null,null,"",{"$nulls":9},{"$f":"IF(ISBLANK(Table1[[#This Row],[Beginning (first occurrence in d mmm yy)]]),\"\",N55)","v":""},{"$f":"IF(ISBLANK('Weekly Trg'!A55),8,IF(WEEKDAY('Weekly Trg'!A55,1)>WEEKDAY('Unit Info'!$B$14,1),WEEKDAY('Weekly Trg'!A55,1)-WEEKDAY('Unit Info'!$B$14,1),WEEKDAY('Weekly Trg'!A55,1)+7-WEEKDAY('Unit Info'!$B$14,1)))","v":8}]
[null,null,"",{"$nulls":9},{"$f":"IF(ISBLANK(Table1[[#This Row],[Beginning (first occurrence in d mmm yy)]]),\"\",N56)","v":""},{"$f":"IF(ISBLANK('Weekly Trg'!A56),8,IF(WEEKDAY('Weekly Trg'!A56,1)>WEEKDAY('Unit Info'!$B$14,1),WEEKDAY('Weekly Trg'!A56,1)-WEEKDAY('Unit Info'!$B$14,1),WEEKDAY('Weekly Trg'!A56,1)+7-WEEKDAY('Unit Info'!$B$14,1)))","v":8}]
[null,null,"",{"$nulls":9},{"$f":"IF(ISBLANK(Table1[[#This Row],[Beginning (first occurrence in d mmm yy)]]),\"\",N57)","v":""},{"$f":"IF(ISBLANK('Weekly Trg'!A57),8,IF(WEEKDAY('Weekly Trg'!A57,1)>WEEKDAY('Unit Info'!$B$14,1),WEEKDAY('Weekly Trg'!A57,1)-WEEKDAY('Unit Info'!$B$14,1),WEEKDAY('Weekly Trg'!A57,1)+7-WEEKDAY('Unit Info'!$B$14,1)))","v":8}]
[null,null,"",{"$nulls":9},{"$f":"IF(ISBLANK(Table1[[#This Row],[Beginning (first occurrence in d mmm yy)]]),\"\",N58)","v":""},{"$f":"IF(ISBLANK('Weekly Trg'!A58),8,IF(WEEKDAY('Weekly Trg'!A58,1)>WEEKDAY('Unit Info'!$B$14,1),WEEKDAY('Weekly Trg'!A58,1)-WEEKDAY('Unit Info'!$B$14,1),WEEKDAY('Weekly Trg'!A58,1)+7-WEEKDAY('Unit Info'!$B$14,1)))","v":8}]
[null,null,"",{"$nulls":9},{"$f":"IF(ISBLANK(Table1[[#This Row],[Beginning (first occurrence in d mmm yy)]]),\"\",N59)","v":""},{"$f":"IF(ISBLANK('Weekly Trg'!A59),8,IF(WEEKDAY('Weekly Trg'!A59,1)>WEEKDAY('Unit Info'!$B$14,1),WEEKDAY('Weekly Trg'!A59,1)-WEEKDAY('Unit Info'!$B$14,1),WEEKDAY('Weekly Trg'!A59,1)+7-WEEKDAY('Unit Info'!$B$14,1)))","v":8}]
[null,null,"",{"$nulls":9},{"$f":"IF(ISBLANK(Table1[[#This Row],[Beginning (first occurrence in d mmm yy)]]),\"\",N60)","v":""},{"$f":"IF(ISBLANK('Weekly Trg'!A60),8,IF(WEEKDAY('Weekly Trg'!A60,1)>WEEKDAY('Unit Info'!$B$14,1),WEEKDAY('Weekly Trg'!A60,1)-WEEKDAY('Unit Info'!$B$14,1),WEEKDAY('Weekly Trg'!A60,1)+7-WEEKDAY('Unit Info'!$B$14,1)))","v":8}]
[null,null,"",{"$nulls":9},{"$f":"IF(ISBLANK(Table1[[#This Row],[Beginning (first occurrence in d mmm yy)]]),\"\",N61)","v":""},{"$f":"IF(ISBLANK('Weekly Trg'!A61),8,IF(WEEKDAY('Weekly Trg'!A61,1)>WEEKDAY('Unit Info'!$B$14,1),WEEKDAY('Weekly Trg'!A61,1)-WEEKDAY('Unit Info'!$B$14,1),WEEKDAY('Weekly Trg'!A61,1)+7-WEEKDAY('Unit Info'!$B$14,1)))","v":8}]
[null,null,"",{"$nulls":9},{"$f":"IF(ISBLANK(Table1[[#This Row],[Beginning (first occurrence in d mmm yy)]]),\"\",N62)","v":""},{"$f":"IF(ISBLANK('Weekly Trg'!A62),8,IF(WEEKDAY('Weekly Trg'!A62,1)>WEEKDAY('Unit Info'!$B$14,1),WEEKDAY('Weekly Trg'!A62,1)-WEEKDAY('Unit Info'!$B$14,1),WEEKDAY('Weekly Trg'!A62,1)+7-WEEKDAY('Unit Info'!$B$14,1)))","v":8}]
[null,null,"",{"$nulls":9},{"$f":"IF(ISBLANK(Table1[[#This Row],[Beginning (first occurrence in d mmm yy)]]),\"\",N63)","v":""},{"$f":"IF(ISBLANK('Weekly Trg'!A63),8,IF(WEEKDAY('Weekly Trg'!A63,1)>WEEKDAY('Unit Info'!$B$14,1),WEEKDAY('Weekly Trg'!A63,1)-WEEKDAY('Unit Info'!$B$14,1),WEEKDAY('Weekly Trg'!A63,1)+7-WEEKDAY('Unit Info'!$B$14,1)))","v":8}]
[null,null,"",{"$nulls":9},{"$f":"IF(ISBLANK(Table1[[#This Row],[Beginning (first occurrence in d mmm yy)]]),\"\",N64)","v":""},{"$f":"IF(ISBLANK('Weekly Trg'!A64),8,IF(WEEKDAY('Weekly Trg'!A64,1)>WEEKDAY('Unit Info'!$B$14,1),WEEKDAY('Weekly Trg'!A64,1)-WEEKDAY('Unit Info'!$B$14,1),WEEKDAY('Weekly Trg'!A64,1)+7-WEEKDAY('Unit Info'!$B$14,1)))","v":8}]
[null,null,"",{"$nulls":9},{"$f":"IF(ISBLANK(Table1[[#This Row],[Beginning (first occurrence in d mmm yy)]]),\"\",N65)","v":""},{"$f":"IF(ISBLANK('Weekly Trg'!A65),8,IF(WEEKDAY('Weekly Trg'!A65,1)>WEEKDAY('Unit Info'!$B$14,1),WEEKDAY('Weekly Trg'!A65,1)-WEEKDAY('Unit Info'!$B$14,1),WEEKDAY('Weekly Trg'!A65,1)+7-WEEKDAY('Unit Info'!$B$14,1)))","v":8}]
[null,null,"",{"$nulls":9},{"$f":"IF(ISBLANK(Table1[[#This Row],[Beginning (first occurrence in d mmm yy)]]),\"\",N66)","v":""},{"$f":"IF(ISBLANK('Weekly Trg'!A66),8,IF(WEEKDAY('Weekly Trg'!A66,1)>WEEKDAY('Unit Info'!$B$14,1),WEEKDAY('Weekly Trg'!A66,1)-WEEKDAY('Unit Info'!$B$14,1),WEEKDAY('Weekly Trg'!A66,1)+7-WEEKDAY('Unit Info'!$B$14,1)))","v":8}]
[null,null,"",{"$nulls":9},{"$f":"IF(ISBLANK(Table1[[#This Row],[Beginning (first occurrence in d mmm yy)]]),\"\",N67)","v":""},{"$f":"IF(ISBLANK('Weekly Trg'!A67),8,IF(WEEKDAY('Weekly Trg'!A67,1)>WEEKDAY('Unit Info'!$B$14,1),WEEKDAY('Weekly Trg'!A67,1)-WEEKDAY('Unit Info'!$B$14,1),WEEKDAY('Weekly Trg'!A67,1)+7-WEEKDAY('Unit Info'!$B$14,1)))","v":8}]
[null,null,{"$f":"IF(ISBLANK(A68),\"\",TEXT(A68,\"DDD\"))","v":""},{"$nulls":9},{"$f":"IF(ISBLANK(Table1[[#This Row],[Beginning (first occurrence in d mmm yy)]]),\"\",N68)","v":""},{"$f":"IF(ISBLANK('Weekly Trg'!A68),8,IF(WEEKDAY('Weekly Trg'!A68,1)>WEEKDAY('Unit Info'!$B$14,1),WEEKDAY('Weekly Trg'!A68,1)-WEEKDAY('Unit Info'!$B$14,1),WEEKDAY('Weekly Trg'!A68,1)+7-WEEKDAY('Unit Info'!$B$14,1)))","v":8}]
[null,null,"",{"$nulls":9},{"$f":"IF(ISBLANK(Table1[[#This Row],[Beginning (first occurrence in d mmm yy)]]),\"\",N69)","v":""},{"$f":"IF(ISBLANK('Weekly Trg'!A69),8,IF(WEEKDAY('Weekly Trg'!A69,1)>WEEKDAY('Unit Info'!$B$14,1),WEEKDAY('Weekly Trg'!A69,1)-WEEKDAY('Unit Info'!$B$14,1),WEEKDAY('Weekly Trg'!A69,1)+7-WEEKDAY('Unit Info'!$B$14,1)))","v":8}]
[null,null,"",{"$nulls":9},{"$f":"IF(ISBLANK(Table1[[#This Row],[Beginning (first occurrence in d mmm yy)]]),\"\",N70)","v":""},{"$f":"IF(ISBLANK('Weekly Trg'!A70),8,IF(WEEKDAY('Weekly Trg'!A70,1)>WEEKDAY('Unit Info'!$B$14,1),WEEKDAY('Weekly Trg'!A70,1)-WEEKDAY('Unit Info'!$B$14,1),WEEKDAY('Weekly Trg'!A70,1)+7-WEEKDAY('Unit Info'!$B$14,1)))","v":8}]
[null,null,"",{"$nulls":9},{"$f":"IF(ISBLANK(Table1[[#This Row],[Beginning (first occurrence in d mmm yy)]]),\"\",N71)","v":""},{"$f":"IF(ISBLANK('Weekly Trg'!A71),8,IF(WEEKDAY('Weekly Trg'!A71,1)>WEEKDAY('Unit Info'!$B$14,1),WEEKDAY('Weekly Trg'!A71,1)-WEEKDAY('Unit Info'!$B$14,1),WEEKDAY('Weekly Trg'!A71,1)+7-WEEKDAY('Unit Info'!$B$14,1)))","v":8}]
[null,null,"",{"$nulls":9},{"$f":"IF(ISBLANK(Table1[[#This Row],[Beginning (first occurrence in d mmm yy)]]),\"\",N72)","v":""},{"$f":"IF(ISBLANK('Weekly Trg'!A72),8,IF(WEEKDAY('Weekly Trg'!A72,1)>WEEKDAY('Unit Info'!$B$14,1),WEEKDAY('Weekly Trg'!A72,1)-WEEKDAY('Unit Info'!$B$14,1),WEEKDAY('Weekly Trg'!A72,1)+7-WEEKDAY('Unit Info'!$B$14,1)))","v":8}]
[null,null,"",{"$nulls":9},{"$f":"IF(ISBLANK(Table1[[#This Row],[Beginning (first occurrence in d mmm yy)]]),\"\",N73)","v":""},{"$f":"IF(ISBLANK('Weekly Trg'!A73),8,IF(WEEKDAY('Weekly Trg'!A73,1)>WEEKDAY('Unit Info'!$B$14,1),WEEKDAY('Weekly Trg'!A73,1)-WEEKDAY('Unit Info'!$B$14,1),WEEKDAY('Weekly Trg'!A73,1)+7-WEEKDAY('Unit Info'!$B$14,1)))","v":8}]
[null,null,"",{"$nulls":9},{"$f":"IF(ISBLANK(Table1[[#This Row],[Beginning (first occurrence in d mmm yy)]]),\"\",N74)","v":""},{"$f":"IF(ISBLANK('Weekly Trg'!A74),8,IF(WEEKDAY('Weekly Trg'!A74,1)>WEEKDAY('Unit Info'!$B$14,1),WEEKDAY('Weekly Trg'!A74,1)-WEEKDAY('Unit Info'!$B$14,1),WEEKDAY('Weekly Trg'!A74,1)+7-WEEKDAY('Unit Info'!$B$14,1)))","v":8}]
[null,null,"",{"$nulls":9},{"$f":"IF(ISBLANK(Table1[[#This Row],[Beginning (first occurrence in d mmm yy)]]),\"\",N75)","v":""},{"$f":"IF(ISBLANK('Weekly Trg'!A75),8,IF(WEEKDAY('Weekly Trg'!A75,1)>WEEKDAY('Unit Info'!$B$14,1),WEEKDAY('Weekly Trg'!A75,1)-WEEKDAY('Unit Info'!$B$14,1),WEEKDAY('Weekly Trg'!A75,1)+7-WEEKDAY('Unit Info'!$B$14,1)))","v":8}]
[null,null,"",{"$nulls":9},{"$f":"IF(ISBLANK(Table1[[#This Row],[Beginning (first occurrence in d mmm yy)]]),\"\",N76)","v":""},{"$f":"IF(ISBLANK('Weekly Trg'!A76),8,IF(WEEKDAY('Weekly Trg'!A76,1)>WEEKDAY('Unit Info'!$B$14,1),WEEKDAY('Weekly Trg'!A76,1)-WEEKDAY('Unit Info'!$B$14,1),WEEKDAY('Weekly Trg'!A76,1)+7-WEEKDAY('Unit Info'!$B$14,1)))","v":8}]
[null,null,"",{"$nulls":9},{"$f":"IF(ISBLANK(Table1[[#This Row],[Beginning (first occurrence in d mmm yy)]]),\"\",N77)","v":""},{"$f":"IF(ISBLANK('Weekly Trg'!A77),8,IF(WEEKDAY('Weekly Trg'!A77,1)>WEEKDAY('Unit Info'!$B$14,1),WEEKDAY('Weekly Trg'!A77,1)-WEEKDAY('Unit Info'!$B$14,1),WEEKDAY('Weekly Trg'!A77,1)+7-WEEKDAY('Unit Info'!$B$14,1)))","v":8}]
[null,null,"",{"$nulls":9},{"$f":"IF(ISBLANK(Table1[[#This Row],[Beginning (first occurrence in d mmm yy)]]),\"\",N78)","v":""},{"$f":"IF(ISBLANK('Weekly Trg'!A78),8,IF(WEEKDAY('Weekly Trg'!A78,1)>WEEKDAY('Unit Info'!$B$14,1),WEEKDAY('Weekly Trg'!A78,1)-WEEKDAY('Unit Info'!$B$14,1),WEEKDAY('Weekly Trg'!A78,1)+7-WEEKDAY('Unit Info'!$B$14,1)))","v":8}]
{"$rows_empty":20}
[null,null,{"$f":"IF(ISBLANK(A99),\"\",TEXT(A99,\"DDD\"))","v":""}]
[null,null,""]
[null,null,""]
[null,null,""]

{"sheet":"Other Activities","index":5,"n_rows":102,"n_cols":22,"rows_kept":102,"merged":[[1,0,1,5],[1,12,1,13],[1,14,1,15],[11,20,16,22]]}
["Enter activity finish date only if different than start date.  Activities beyond 48 hrs will be counted as two supported days, not generally to exceed 5 meals."]
["Enter dates in d mmm yy format and times in HH:mm (24 Hour Clock)",{"$nulls":11},"QM Support Required",null,"Expected Participants"]
["Activity Start Date","Day","Start Time","Activity End Date (if different than start)","Finish Time","Activity Name or Description","Location","Dress","OPI","Supported (Yes/No)","Out of Region? (Yes/No)","Type of Supported Day (see side note)","General Stores (Pots, stoves, etc)  (Y/N)","Sleeping Bags, Tents, Mattresses  (Y/N)","Cadets","Staff","Activity Request Due","Total Expected"]
["2019-09-27",{"$f":"IF(A4<>\"\",TEXT(A4,\"ddd\"),\"\")","v":"Fri"},"18:00:00","2019-09-29","14:00:00","Biv / Survival FTX","Woodland Trails Scout Camp","FTU","2Lt Chen","Y","N","Bivouac FTX","Y","N",50,4,{"$f":"IF(ISBLANK(A4),\"\",IF(AND(ISBLANK(J4),ISBLANK(K4)),\"\",IF(AND(OR(J4=\"No\",J4=\"n\"),OR(K4=\"No\",K4=\"n\")),\"\",IF(OR(K4=\"YES\",K4=\"y\"),A4-105,IF(OR(J4=\"yes\",J4=\"y\"),A4-45,\"Check entry\")))))","v":"2019-08-13"},{"$f":"SUM(O4:P4)","v":54}]
["2019-09-27","Fri","18:00:00","2019-09-29","18:00:00","Silver / Gold Star CES","CES",null,null,"N","N",{"$nulls":3},15,null,"",15]
["2019-10-05","Sat","08:00:00","2019-10-05","16:00:00","GGHG Change of Command Practice Day","Denison Armoury","FTU","Lt Heaton","N","N",{"$nulls":3},30,1,"",31,null,"Type of Supported Day, Refer To QSP:"]
["2019-10-06","Sun","08:00:00","2019-10-06","14:00:00","GGHG Change of Command Parade","Denison Armoury","C-1","Lt Heaton","N","N",{"$nulls":3},30,1,"",31,{"$nulls":3},"Required"]
["2019-10-19","Sat","09:00:00","2019-10-19","17:00:00","RDA - Orienteering Competition","TBD",null,null,"N","N",{"$nulls":5},"",0,null,"Mand/Comp Trg Pds",null,"4 Days"]
["2019-10-25","Fri","17:30:00","2019-10-26","17:30:00","Fall Tag Days","MDVA","C-2","Capt Stagg","N","N",{"$nulls":5},"",0,null,"Bivouac FTX",null,"1 Wknd"]
["2019-11-09","Sat","10:00:00","2019-11-09","14:00:00","MDVA Remembrance Day Ceremony","MDVA","C-1","Capt Carlsen","N","N",{"$nulls":3},55,3,"",58,null,"Expedition FTX",null,"1 Wknd"]
["2019-11-11","Mon","10:00:00","2019-11-11","15:00:00","City of Markham Veteran's Luncheon","Markham City Hall","C-1","Capt Carlsen","N",{"$nulls":4},12,1,"Check entry",13,null,"Cold Wx/Adv Trg FTX",null,"1 Wknd"]
["2019-11-16","Sat","08:00:00","2019-11-17","17:00:00","PO513 Workshop","TBD","C-2",null,"Y","N",{"$nulls":3},4,4,"2019-10-02",8,null,"Other","(support in the form of non consumable general stores and equipment such as canoe, abseil kit, first aid trg kit, etc., may be provided where it does not impede support to required training)"]
["2019-11-23","Sat","10:00:00","2019-11-23","12:30:00","Markham Santa Claus Parade","MDVA","C-2","Capt Carlsen","N","N",{"$nulls":5},"",0]
["2019-11-23","Sat","12:30:00","2019-11-23","20:30:00","Ex Worthy Charge","MDVA","FTU / Civvies","Lt Heaton","Y","N",{"$nulls":3},25,1,"2019-10-09",26]
["2019-12-08","Sun","13:00:00","2019-12-08","16:00:00","MDVA - Jack Paley Birthday Party (Veteran)","MDVA","C-1","Capt Carlsen","N","N",{"$nulls":3},8,1,"",9]
["2019-12-16","Mon","16:00:00","2019-12-16","22:00:00","Leadership evening","MDVA","C-1","Capt Carlsen","Y","N","Mand/Comp Trg Pds",null,null,55,5,"2019-11-01",60]
["2020-01-18","Sat","08:00:00","2020-01-19","18:00:00","RDA - Biathlon Competition","Nordic Highlands","Ski Gear",null,"N","N",null,null,"N",35,4,"",39]
["2020-02-07","Fri","18:00:00","2020-02-08","14:00:00","Range Weekend","MDVA","Civvies","Capt Carlsen","Y","N","Mand/Comp Trg Pds","Y","N",35,4,"2019-12-24",39]
["2020-02-29","Sat","08:00:00","2020-03-01","18:00:00","RDA - Marksmanship Competition","Moss Park","Pyjamas","Capt Carlsen","N","N",{"$nulls":5},"",0]
["2020-02-29","Sat","08:00:00","2020-02-29","17:00:00","Marksmanship Competition","Moss Park","Civvies","Capt Carlsen",{"$nulls":7},"",0]
["2020-03-01","Sun","08:00:00","2020-03-01","17:00:00","Marksmanship Competition","Moss Park","Civvies","Capt Carlsen",{"$nulls":7},"",0]
["2020-03-06","Fri","18:00:00","2020-03-08","14:00:00","Adventure Weekend","Woodland Trails Scout Camp","FTU","2Lt Chen","Y","N","Cold Wx/Adv Trg FTX","Y","N",50,4,"2020-01-21",54]
["2020-04-14","Tue","16:30:00","2020-04-14","19:00:00","Bowling Night","Markham Bowl","FTU","Capt Carlsen","N","N",{"$nulls":5},"",0]
["2020-04-25","Sat","09:00:00","2020-04-25","14:00:00","Clean Up the Rouge","MDVA","FTU","Capt Stagg","Y","N","Mand/Comp Trg Pds","Y","N",50,4,"2020-03-11",54]
["2020-05-01","Fri","18:00:00","2020-05-03","14:00:00","Nav/Trek ","Woodland Trails Scout Camp","FTU","Lt Heaton","Y","N","Expedition FTX","N","N",50,3,"2020-03-17",53]
["2020-05-09","Sat","09:00:00","2020-05-09","14:00:00","Treetop Trekking","Stouffville","Civvies","2Lt Chen","Y","N","Mand/Comp Trg Pds",{"$nulls":4},"2020-03-25",0]
["2020-05-22","Fri","09:00:00","2020-05-23","17:30:00","Spring Tag Days","MDVA","C-2","Capt Stagg","N","N",{"$nulls":5},"",0]
["2020-06-07","Sun","09:00:00","2020-06-07","17:00:00","Annual Ceremonial Review","MDVA","C-1","Capt Carlsen","N","N",{"$nulls":5},"",0]
[null,"",{"$nulls":14},"",0]
[null,"",{"$nulls":14},"",0]
[null,"",{"$nulls":14},"",0]
[null,"",{"$nulls":14},"",0]
[null,"",{"$nulls":14},"",0]
[null,"",{"$nulls":14},"",0]
[null,"",{"$nulls":14},"",0]
[null,{"$f":"IF(A36<>\"\",TEXT(A36,\"ddd\"),\"\")","v":""},{"$nulls":14},{"$f":"IF(ISBLANK(A36),\"\",IF(AND(ISBLANK(J36),ISBLANK(K36)),\"\",IF(AND(OR(J36=\"No\",J36=\"n\"),OR(K36=\"No\",K36=\"n\")),\"\",IF(OR(K36=\"YES\",K36=\"y\"),A36-105,IF(OR(J36=\"yes\",J36=\"y\"),A36-45,\"Check entry\")))))","v":""},{"$f":"SUM(O36:P36)","v":0}]
[null,"",{"$nulls":14},"",0]
[null,"",{"$nulls":14},"",0]
[null,"",{"$nulls":14},"",0]
[null,"",{"$nulls":14},"",0]
[null,"",{"$nulls":14},"",0]
[null,"",{"$nulls":14},"",0]
[null,"",{"$nulls":14},"",0]
[null,"",{"$nulls":14},"",0]
[null,"",{"$nulls":14},"",0]
[null,"",{"$nulls":14},"",0]
[null,"",{"$nulls":14},"",0]
[null,"",{"$nulls":14},"",0]
[null,"",{"$nulls":14},"",0]
[null,"",{"$nulls":14},"",0]
[null,"",{"$nulls":14},"",0]
[null,"",{"$nulls":14},"",0]
[null,"",{"$nulls":14},"",0]
[null,"",{"$nulls":14},"",0]
[null,"",{"$nulls":14},"",0]
[null,"",{"$nulls":14},"",0]
[null,"",{"$nulls":14},"",0]
[null,"",{"$nulls":14},"",0]
[null,"",{"$nulls":14},"",0]
[null,"",{"$nulls":14},"",0]
[null,"",{"$nulls":14},"",0]
[null,"",{"$nulls":14},"",0]
[null,"",{"$nulls":14},"",0]
[null,"",{"$nulls":14},"",0]
[null,"",{"$nulls":14},"",0]
[null,"",{"$nulls":14},"",0]
[null,"",{"$nulls":14},"",0]
[null,{"$f":"IF(A68<>\"\",TEXT(A68,\"ddd\"),\"\")","v":""},{"$nulls":14},{"$f":"IF(ISBLANK(A68),\"\",IF(AND(ISBLANK(J68),ISBLANK(K68)),\"\",IF(AND(OR(J68=\"No\",J68=\"n\"),OR(K68=\"No\",K68=\"n\")),\"\",IF(OR(K68=\"YES\",K68=\"y\"),A68-105,IF(OR(J68=\"yes\",J68=\"y\"),A68-45,\"Check entry\")))))","v":""},{"$f":"SUM(O68:P68)","v":0}]
[null,"",{"$nulls":14},"",0]
[null,"",{"$nulls":14},"",0]
[null,"",{"$nulls":14},"",0]
[null,"",{"$nulls":14},"",0]
[null,"",{"$nulls":14},"",0]
[null,"",{"$nulls":14},"",0]
[null,"",{"$nulls":14},"",0]
[null,"",{"$nulls":14},"",0]
[null,"",{"$nulls":14},"",0]
[null,"",{"$nulls":14},"",0]
[null,"",{"$nulls":14},"",0]
[null,"",{"$nulls":14},"",0]
[null,"",{"$nulls":14},"",0]
[null,"",{"$nulls":14},"",0]
[null,"",{"$nulls":14},"",0]
[null,"",{"$nulls":14},"",0]
[null,"",{"$nulls":14},"",0]
[null,"",{"$nulls":14},"",0]
[null,"",{"$nulls":14},"",0]
[null,"",{"$nulls":14},"",0]
[null,"",{"$nulls":14},"",0]
[null,"",{"$nulls":14},"",0]
[null,"",{"$nulls":14},"",0]
[null,"",{"$nulls":14},"",0]
[null,"",{"$nulls":14},"",0]
[null,"",{"$nulls":14},"",0]
[null,"",{"$nulls":14},"",0]
[null,"",{"$nulls":14},"",0]
[null,"",{"$nulls":14},"",0]
[null,"",{"$nulls":14},"",0]
[null,"",{"$nulls":14},"",0]
[null,{"$f":"IF(A100<>\"\",TEXT(A100,\"ddd\"),\"\")","v":""},{"$nulls":14},"",0]
[null,"",{"$nulls":14},"",0]
[null,"",{"$nulls":14},"",0]

{"sheet":"Duty Pers","index":6,"n_rows":47,"n_cols":10,"rows_kept":47}
[null,null,"Enter the title(s) of up to seven duty positions into the header bar (Row 2) of any of the seven columns (C-I), then list the names of the assigned duty person in the rows below corresponding to the appropriate date."]
["Week / RO No.","Date","Duty Officer","Duty NCO","Duty NCM",{"$nulls":4},"Notes"]
[{"$f":"IF(AND(MONTH(B3)=1,_xlfn.ISOWEEKNUM(B3)=52),CONCATENATE(TEXT(B3-365,\"yy\"),\"-\",TEXT(_xlfn.ISOWEEKNUM(B3),\"00#\")),CONCATENATE(TEXT(B3,\"yy\"),\"-\",TEXT(_xlfn.ISOWEEKNUM(B3),\"00#\")))","v":"19-037"},{"$f":"'In-year Trg Plan'!D$4","v":"2019-09-12"},"Capt Stagg","RSM"]
[{"$f":"IF(AND(MONTH(B4)=1,_xlfn.ISOWEEKNUM(B4)=52),CONCATENATE(TEXT(B4-365,\"yy\"),\"-\",TEXT(_xlfn.ISOWEEKNUM(B4),\"00#\")),CONCATENATE(TEXT(B4,\"yy\"),\"-\",TEXT(_xlfn.ISOWEEKNUM(B4),\"00#\")))","v":"19-038"},{"$f":"'In-year Trg Plan'!E$4","v":"2019-09-19"},"2Lt Chen","DSM"]
["19-039",{"$f":"'In-year Trg Plan'!F$4","v":"2019-09-26"},"Lt Heaton","RSM"]
["19-040",{"$f":"'In-year Trg Plan'!G$4","v":"2019-10-03"},"Capt Carlsen","DSM"]
["19-041",{"$f":"'In-year Trg Plan'!H$4","v":"2019-10-10"},"Capt Stagg","RSM"]
["19-042",{"$f":"'In-year Trg Plan'!I$4","v":"2019-10-17"},"2Lt Chen","DSM"]
["19-043",{"$f":"'In-year Trg Plan'!J$4","v":"2019-10-24"},"Lt Heaton","RSM"]
["19-045",{"$f":"'In-year Trg Plan'!K$4","v":"2019-11-07"},"Capt Carlsen","DSM"]
["19-046",{"$f":"'In-year Trg Plan'!L$4","v":"2019-11-14"},"Capt Stagg","RSM"]
["19-047",{"$f":"'In-year Trg Plan'!M$4","v":"2019-11-21"},"2Lt Chen","DSM"]
["19-048",{"$f":"'In-year Trg Plan'!N$4","v":"2019-11-28"},"Lt Heaton","RSM"]
["19-049",{"$f":"'In-year Trg Plan'!O$4","v":"2019-12-05"},"Capt Carlsen","DSM"]
["19-050",{"$f":"'In-year Trg Plan'!P$4","v":"2019-12-12"},"Capt Stagg","RSM"]
["19-051",{"$f":"'In-year Trg Plan'!Q$4","v":"2019-12-19"}]
["19-052",{"$f":"'In-year Trg Plan'!R$4","v":"2019-12-26"}]
["20-001",{"$f":"'In-year Trg Plan'!S$4","v":"2020-01-02"}]
["20-002",{"$f":"'In-year Trg Plan'!T$4","v":"2020-01-09"},"2Lt Chen","DSM"]
["20-003",{"$f":"'In-year Trg Plan'!U$4","v":"2020-01-16"},"Lt Heaton","RSM"]
["20-004",{"$f":"'In-year Trg Plan'!V$4","v":"2020-01-23"}]
["20-005",{"$f":"'In-year Trg Plan'!W$4","v":"2020-01-30"},"Capt Carlsen","DSM","Cpl Lam, Irene"]
["20-006",{"$f":"'In-year Trg Plan'!X$4","v":"2020-02-06"},"Lt Heaton","RSM","Sgt Deng L"]
["20-007",{"$f":"'In-year Trg Plan'!Y$4","v":"2020-02-13"},"Capt Carlsen","DSM","Cpl Sankaran, Cheron"]
["20-008",{"$f":"'In-year Trg Plan'!Z$4","v":"2020-02-20"},"Capt Stagg","RSM","Cpl Narayan, Pranoy"]
["20-009",{"$f":"'In-year Trg Plan'!AA$4","v":"2020-02-27"},"2Lt Chen","DSM","Cpl Lam Irene"]
["20-010",{"$f":"'In-year Trg Plan'!AB$4","v":"2020-03-05"},"Lt Heaton","RSM","MCpl Tsang, Yvonne"]
["20-011",{"$f":"'In-year Trg Plan'!AC$4","v":"2020-03-12"}]
["20-012",{"$f":"'In-year Trg Plan'!AD$4","v":"2020-03-19"},"Capt Stagg","RSM","Cdt Drummond, Jack"]
["20-013",{"$f":"'In-year Trg Plan'!AE$4","v":"2020-03-26"},"Capt Carlsen","DSM","Sgt Deng A"]
["20-014",{"$f":"'In-year Trg Plan'!AF$4","v":"2020-04-02"},"2Lt Chen","RSM","Cpl Prabu Prakayla"]
["20-015",{"$f":"'In-year Trg Plan'!AG$4","v":"2020-04-09"},"Lt Heaton","DSM","Cdt Chen Vaness"]
["20-016",{"$f":"'In-year Trg Plan'!AH$4","v":"2020-04-16"},"Capt Stagg","RSM","Mcpl Chen Vincent"]
["20-017",{"$f":"'In-year Trg Plan'!AI$4","v":"2020-04-23"},"2Lt Chen","DSM","Cpl Sankaran, Cheron"]
["20-018",{"$f":"'In-year Trg Plan'!AJ$4","v":"2020-04-30"},"Lt Heaton","RSM","Cpl Narayan, Pranoy"]
["20-019",{"$f":"'In-year Trg Plan'!AK$4","v":"2020-05-07"},"Capt Carlsen","DSM","Cpl Vimalanathan, Thanoshgsan"]
["20-020",{"$f":"'In-year Trg Plan'!AL$4","v":"2020-05-14"},"Capt Stagg","RSM","MCpl Tsang, Yvonne"]
["20-021",{"$f":"'In-year Trg Plan'!AM$4","v":"2020-05-21"},"2Lt Chen","DSM","Sgt Deng, L"]
["20-022",{"$f":"'In-year Trg Plan'!AN$4","v":"2020-05-28"},"Lt Heaton","RSM","Cpl Ye, Marco"]
["20-023",{"$f":"'In-year Trg Plan'!AO$4","v":"2020-06-04"},"Capt Carlsen","DSM","Cdt Drummond, Jack"]
["20-024",{"$f":"'In-year Trg Plan'!AP$4","v":"2020-06-11"}]
["20-025",{"$f":"'In-year Trg Plan'!AQ$4","v":"2020-06-18"}]
["20-026",{"$f":"'In-year Trg Plan'!AR$4","v":"2020-06-25"}]
["20-027",{"$f":"'In-year Trg Plan'!AS$4","v":"2020-07-02"}]
["20-028",{"$f":"'In-year Trg Plan'!AT$4","v":"2020-07-09"}]
["20-029",{"$f":"'In-year Trg Plan'!AU$4","v":"2020-07-16"}]
["20-030",{"$f":"'In-year Trg Plan'!AV$4","v":"2020-07-23"}]

{"sheet":"Routine Order","index":7,"n_rows":119,"n_cols":15,"rows_kept":119,"merged":[[0,0,0,11],[1,0,1,11],[4,8,4,11],[6,8,6,11],[8,8,8,11],[10,0,10,1],[10,8,10,11],[11,0,11,2],[11,3,11,4],[12,0,12,2],[12,8,12,11],[14,8,14,11],[16,8,16,11],[18,8,18,11],[19,0,19,2],[19,3,19,4],[19,8,19,11],[21,0,21,11],[23,2,23,4],[23,5,23,7],[23,8,23,11],[24,8,24,9],[25,0,28,0],[25,2,25,4],[25,5,25,7],[25,8,25,11],[26,2,26,4],[26,5,26,7],[26,8,26,11],[27,2,27,4],[27,5,27,7],[27,8,27,11],[28,2,28,4],[28,5,28,7],[28,8,28,11],[29,0,32,0],[29,2,29,4],[29,5,29,7],[29,8,29,11],[30,2,30,4],[30,5,30,7],[30,8,30,11],[31,2,31,4],[31,5,31,7],[31,8,31,11],[32,2,32,4],[32,5,32,7],[32,8,32,11],[33,0,36,0],[33,2,33,4],[33,5,33,7],[33,8,33,11],[34,2,34,4],[34,5,34,7],[34,8,34,11],[35,2,35,4],[35,5,35,7],[35,8,35,11],[36,2,36,4],[36,5,36,7],[36,8,36,11],[37,0,40,0],[37,2,37,4],[37,5,37,7],[37,8,37,11],[38,2,38,4],[38,5,38,7],[38,8,38,11],[39,2,39,4],[39,5,39,7],[39,8,39,11],[40,2,40,4],[40,5,40,7],[40,8,40,11],[41,0,44,0],[41,2,41,4],[41,5,41,7],[41,8,41,11],[42,2,42,4],[42,5,42,7],[42,8,42,11],[43,2,43,4],[43,5,43,7],[43,8,43,11],[44,2,44,4],[44,5,44,7],[44,8,44,11],[46,0,46,11],[48,4,48,6],[48,7,48,8],[48,10,48,11],[48,14,63,15],[49,4,49,6],[49,7,49,8],[49,10,49,11],[50,4,50,6],[50,7,50,8],[50,10,50,11],[51,4,51,6],[51,7,51,8],[51,10,51,11],[52,4,52,6],[52,7,52,8],[52,10,52,11],[53,4,53,6],[53,7,53,8],[53,10,53,11],[54,4,54,6],[54,7,54,8],[54,10,54,11],[55,4,55,6],[55,7,55,8],[55,10,55,11],[56,4,56,6],[56,7,56,8],[56,10,56,11],[57,4,57,6],[57,7,57,8],[57,10,57,11],[58,4,58,6],[58,7,58,8],[58,10,58,11],[59,4,59,6],[59,7,59,8],[59,10,59,11],[60,4,60,6],[60,7,60,8],[60,10,60,11],[61,4,61,6],[61,7,61,8],[61,10,61,11],[62,4,62,6],[62,7,62,8],[62,10,62,11],[63,4,63,6],[63,7,63,8],[63,10,63,11],[66,0,66,11],[68,0,68,1],[68,2,68,3],[68,4,68,6],[68,7,68,8],[68,10,68,11],[69,4,69,6],[69,7,69,8],[69,10,69,11],[70,4,70,6],[70,7,70,8],[70,10,70,11],[71,4,71,6],[71,7,71,8],[71,10,71,11],[72,4,72,6],[72,7,72,8],[72,10,72,11],[73,4,73,6],[73,7,73,8],[73,10,73,11],[74,4,74,6],[74,7,74,8],[74,10,74,11],[75,4,75,6],[75,7,75,8],[75,10,75,11],[76,4,76,6],[76,7,76,8],[76,10,76,11],[77,4,77,6],[77,7,77,8],[77,10,77,11],[78,4,78,6],[78,7,78,8],[78,10,78,11],[79,4,79,6],[79,7,79,8],[79,10,79,11],[80,4,80,6],[80,7,80,8],[80,10,80,11],[81,4,81,6],[81,7,81,8],[81,10,81,11],[82,4,82,6],[82,7,82,8],[82,10,82,11],[83,4,83,6],[83,7,83,8],[83,10,83,11],[85,0,85,11],[87,0,87,11],[88,0,88,11],[89,0,89,11],[90,0,90,11],[91,0,91,11],[92,0,92,11],[93,0,93,11],[94,0,94,11],[95,0,95,11],[96,0,96,11],[97,0,97,11],[98,0,98,11],[99,0,99,11],[100,0,100,11],[101,0,101,11],[102,0,102,11],[103,0,103,11],[104,0,104,11],[105,0,105,11],[106,0,106,11],[107,0,107,11],[108,0,108,11],[109,0,109,11],[110,0,110,11]]}
[{"$f":"'Unit Info'!$B$1","v":"748 Army RCACC"}]
["Weekly Routine Orders"]
["Date:",{"$f":"IF(ISBLANK($C$3),\"Enter RO date (d mmm yy):\",(TEXT($C$3,\"ddd\")))","v":"Thu"},"2020-03-26",{"$nulls":6},"RO No.",null,{"$f":"IF(AND(MONTH($C$3)=1,_xlfn.ISOWEEKNUM($C$3)=52),CONCATENATE(TEXT($C$3-365,\"yy\"),\"-\",TEXT(_xlfn.ISOWEEKNUM($C$3),\"00#\")),CONCATENATE(TEXT($C$3,\"yy\"),\"-\",TEXT(_xlfn.ISOWEEKNUM($C$3),\"00#\")))","v":"20-013"}]
[]
["CAF Member Dress:",null,{"$f":"HLOOKUP($C$3,'In-year Trg Plan'!$D$4:$AV$67,63,FALSE)","v":"1A"},{"$nulls":4},"Duty Personnel:"]
[]
["Cadet Dress:",null,{"$f":"HLOOKUP($C$3,'In-year Trg Plan'!$D$4:$AV$67,64,FALSE)","v":"C-1"},{"$nulls":4},{"$f":"IF(ISBLANK('Duty Pers'!$C$2),,CONCATENATE('Duty Pers'!$C$2,\":\"))","v":"Duty Officer:"},{"$f":"IF(ISBLANK('Duty Pers'!$C$2),,VLOOKUP($C$3,'Duty Pers'!$B$3:$I$47,2,FALSE))","v":"Capt Carlsen"}]
[]
["Training Night Routine:",{"$nulls":6},{"$f":"IF(ISBLANK('Duty Pers'!$D$2),,CONCATENATE('Duty Pers'!$D$2,\":\"))","v":"Duty NCO:"},{"$f":"IF(ISBLANK('Duty Pers'!$D$2),,VLOOKUP($C$3,'Duty Pers'!$B$3:$I$47,3,FALSE))","v":"DSM"}]
["(All times 24hr clock)"]
[{"$nulls":3},"Start","Finish",null,null,{"$f":"IF(ISBLANK('Duty Pers'!$E$2),,CONCATENATE('Duty Pers'!$E$2,\":\"))","v":"Duty NCM:"},{"$f":"IF(ISBLANK('Duty Pers'!$E$2),,VLOOKUP($C$3,'Duty Pers'!$B$3:$I$47,4,FALSE))","v":"Sgt Deng A"}]
["Arrival",null,null,{"$f":"'Unit Info'!B4","v":"18:30:00"}]
["Fall-In / Inspection / Opening",null,null,{"$f":"'Unit Info'!B5","v":"18:40:00"},{"$f":"'Unit Info'!C5","v":"18:55:00"},null,null,{"$f":"IF(ISBLANK('Duty Pers'!$F$2),,CONCATENATE('Duty Pers'!$F$2,\":\"))","v":0},{"$f":"IF(ISBLANK('Duty Pers'!$F$2),,VLOOKUP($C$3,'Duty Pers'!$B$3:$I$47,5,FALSE))","v":0}]
["Period One",null,null,{"$f":"'Unit Info'!B6","v":"19:00:00"},{"$f":"'Unit Info'!C6","v":"19:45:00"}]
["Break",null,null,{"$f":"'Unit Info'!B7","v":"19:45:00"},{"$f":"'Unit Info'!C7","v":"19:59:00"},null,null,{"$f":"IF(ISBLANK('Duty Pers'!$G$2),,CONCATENATE('Duty Pers'!$G$2,\":\"))","v":0},{"$f":"IF(ISBLANK('Duty Pers'!$G$2),,VLOOKUP($C$3,'Duty Pers'!$B$3:$I$47,6,FALSE))","v":0}]
["Period Two",null,null,{"$f":"'Unit Info'!B8","v":"20:00:00"},{"$f":"'Unit Info'!C8","v":"20:45:00"}]
["Break",null,null,{"$f":"'Unit Info'!B9","v":"20:46:00"},{"$f":"'Unit Info'!C9","v":"20:59:00"},null,null,{"$f":"IF(ISBLANK('Duty Pers'!$H$2),,CONCATENATE('Duty Pers'!$H$2,\":\"))","v":0},{"$f":"IF(ISBLANK('Duty Pers'!$H$2),,VLOOKUP($C$3,'Duty Pers'!$B$3:$I$47,7,FALSE))","v":0}]
["Period Three",null,null,{"$f":"'Unit Info'!B10","v":"21:00:00"},{"$f":"'Unit Info'!C10","v":"21:45:00"}]
["Fall-In / Closing",null,null,{"$f":"'Unit Info'!B11","v":"21:46:00"},{"$f":"'Unit Info'!C11","v":"22:00:00"},null,null,{"$f":"IF(ISBLANK('Duty Pers'!$I$2),,CONCATENATE('Duty Pers'!$I$2,\":\"))","v":0},{"$f":"IF(ISBLANK('Duty Pers'!$I$2),,VLOOKUP($C$3,'Duty Pers'!$B$3:$I$47,8,FALSE))","v":0}]
["Dismissal Time",null,null,{"$f":"'Unit Info'!B12","v":"22:00:00"}]
[]
["Mandatory Training"]
[]
[null,null,"Period 1",null,null,"Period 2",null,null,"Period 3"]
[null,null,{"$f":"'Unit Info'!$B$6","v":"19:00:00"},"to",{"$f":"'Unit Info'!$C$6","v":"19:45:00"},{"$f":"'Unit Info'!$B$8","v":"20:00:00"},"to",{"$f":"'Unit Info'!$C$8","v":"20:45:00"},{"$f":"'Unit Info'!$B$10","v":"21:00:00"},null,"to",{"$f":"'Unit Info'!$C$10","v":"21:45:00"}]
["Green Star","PO/EO",{"$f":"HLOOKUP($C$3,'In-year Trg Plan'!$D$4:$AV$67,2,FALSE)","v":"CO Parade"},null,null,{"$f":"HLOOKUP($C$3,'In-year Trg Plan'!$D$4:$AV$67,6,FALSE)","v":"C-122.01a"},null,null,{"$f":"HLOOKUP($C$3,'In-year Trg Plan'!$D$4:$AV$67,10,FALSE)","v":"C-122.01b"}]
[null,"PO Title",{"$f":"HLOOKUP($C$3,'In-year Trg Plan'!$D$4:$AV$67,3,FALSE)","v":"CO's Parade"},null,null,{"$f":"HLOOKUP($C$3,'In-year Trg Plan'!$D$4:$AV$67,7,FALSE)","v":"Navigation"},null,null,{"$f":"HLOOKUP($C$3,'In-year Trg Plan'!$D$4:$AV$67,11,FALSE)","v":"Navigation"}]
[null,"Instructor",{"$f":"HLOOKUP($C$3,'In-year Trg Plan'!$D$4:$AV$67,4,FALSE)","v":"CO"},null,null,{"$f":"HLOOKUP($C$3,'In-year Trg Plan'!$D$4:$AV$67,8,FALSE)","v":"2Lt Chen"},null,null,{"$f":"HLOOKUP($C$3,'In-year Trg Plan'!$D$4:$AV$67,12,FALSE)","v":"2Lt Chen"}]
[null,"Location",{"$f":"HLOOKUP($C$3,'In-year Trg Plan'!$D$4:$AV$67,5,FALSE)","v":"Parking Lot"},null,null,{"$f":"HLOOKUP($C$3,'In-year Trg Plan'!$D$4:$AV$67,9,FALSE)","v":"Green Star Room (A)"},null,null,{"$f":"HLOOKUP($C$3,'In-year Trg Plan'!$D$4:$AV$67,13,FALSE)","v":"Green Star Room (A)"}]
["Red Star","PO/EO",{"$f":"HLOOKUP($C$3,'In-year Trg Plan'!$D$4:$AV$67,14,FALSE)","v":"CO Parade"},null,null,{"$f":"HLOOKUP($C$3,'In-year Trg Plan'!$D$4:$AV$67,18,FALSE)","v":"M222.01"},null,null,{"$f":"HLOOKUP($C$3,'In-year Trg Plan'!$D$4:$AV$67,22,FALSE)","v":"M222.02"}]
[null,"PO Title",{"$f":"HLOOKUP($C$3,'In-year Trg Plan'!$D$4:$AV$67,15,FALSE)","v":"CO's Parade"},null,null,{"$f":"HLOOKUP($C$3,'In-year Trg Plan'!$D$4:$AV$67,19,FALSE)","v":"Navigation"},null,null,{"$f":"HLOOKUP($C$3,'In-year Trg Plan'!$D$4:$AV$67,23,FALSE)","v":"Navigation"}]
[null,"Instructor",{"$f":"HLOOKUP($C$3,'In-year Trg Plan'!$D$4:$AV$67,16,FALSE)","v":"CO"},null,null,{"$f":"HLOOKUP($C$3,'In-year Trg Plan'!$D$4:$AV$67,20,FALSE)","v":"WO Ma"},null,null,{"$f":"HLOOKUP($C$3,'In-year Trg Plan'!$D$4:$AV$67,24,FALSE)","v":"WO Ma"}]
[null,"Location",{"$f":"HLOOKUP($C$3,'In-year Trg Plan'!$D$4:$AV$67,17,FALSE)","v":"Parking Lot"},null,null,{"$f":"HLOOKUP($C$3,'In-year Trg Plan'!$D$4:$AV$67,21,FALSE)","v":"Back Classroom"},null,null,{"$f":"HLOOKUP($C$3,'In-year Trg Plan'!$D$4:$AV$67,25,FALSE)","v":"Back Classroom"}]
["Silver Star","PO/EO",{"$f":"HLOOKUP($C$3,'In-year Trg Plan'!$D$4:$AV$67,26,FALSE)","v":"CO Parade"},null,null,{"$f":"HLOOKUP($C$3,'In-year Trg Plan'!$D$4:$AV$67,30,FALSE)","v":"M322.01"},null,null,{"$f":"HLOOKUP($C$3,'In-year Trg Plan'!$D$4:$AV$67,34,FALSE)","v":"M322.02"}]
[null,"PO Title",{"$f":"HLOOKUP($C$3,'In-year Trg Plan'!$D$4:$AV$67,27,FALSE)","v":"CO's Parade"},null,null,{"$f":"HLOOKUP($C$3,'In-year Trg Plan'!$D$4:$AV$67,31,FALSE)","v":"Navigation"},null,null,{"$f":"HLOOKUP($C$3,'In-year Trg Plan'!$D$4:$AV$67,35,FALSE)","v":"Navigation"}]
[null,"Instructor",{"$f":"HLOOKUP($C$3,'In-year Trg Plan'!$D$4:$AV$67,28,FALSE)","v":"CO"},null,null,{"$f":"HLOOKUP($C$3,'In-year Trg Plan'!$D$4:$AV$67,32,FALSE)","v":"WO Mallon"},null,null,{"$f":"HLOOKUP($C$3,'In-year Trg Plan'!$D$4:$AV$67,36,FALSE)","v":"WO Mallon"}]
[null,"Location",{"$f":"HLOOKUP($C$3,'In-year Trg Plan'!$D$4:$AV$67,29,FALSE)","v":"Parking Lot"},null,null,{"$f":"HLOOKUP($C$3,'In-year Trg Plan'!$D$4:$AV$67,33,FALSE)","v":"Green Star Rm (B)"},null,null,{"$f":"HLOOKUP($C$3,'In-year Trg Plan'!$D$4:$AV$67,37,FALSE)","v":"Green Star Rm (B)"}]
["Gold Star","PO/EO",{"$f":"HLOOKUP($C$3,'In-year Trg Plan'!$D$4:$AV$67,38,FALSE)","v":"CO Parade"},null,null,{"$f":"HLOOKUP($C$3,'In-year Trg Plan'!$D$4:$AV$67,42,FALSE)","v":"M422.01"},null,null,{"$f":"HLOOKUP($C$3,'In-year Trg Plan'!$D$4:$AV$67,46,FALSE)","v":"M422.02"}]
[null,"PO Title",{"$f":"HLOOKUP($C$3,'In-year Trg Plan'!$D$4:$AV$67,39,FALSE)","v":"CO's Parade"},null,null,{"$f":"HLOOKUP($C$3,'In-year Trg Plan'!$D$4:$AV$67,43,FALSE)","v":"Navigation"},null,null,{"$f":"HLOOKUP($C$3,'In-year Trg Plan'!$D$4:$AV$67,47,FALSE)","v":"Navigation"}]
[null,"Instructor",{"$f":"HLOOKUP($C$3,'In-year Trg Plan'!$D$4:$AV$67,40,FALSE)","v":"CO"},null,null,{"$f":"HLOOKUP($C$3,'In-year Trg Plan'!$D$4:$AV$67,44,FALSE)","v":"Lt Heaton"},null,null,{"$f":"HLOOKUP($C$3,'In-year Trg Plan'!$D$4:$AV$67,48,FALSE)","v":"Lt Heaton"}]
[null,"Location",{"$f":"HLOOKUP($C$3,'In-year Trg Plan'!$D$4:$AV$67,41,FALSE)","v":"Parking Lot"},null,null,{"$f":"HLOOKUP($C$3,'In-year Trg Plan'!$D$4:$AV$67,45,FALSE)","v":"Upstairs Classroom"},null,null,{"$f":"HLOOKUP($C$3,'In-year Trg Plan'!$D$4:$AV$67,49,FALSE)","v":"Upstairs Classroom"}]
["Master Cadet","PO/EO",{"$f":"HLOOKUP($C$3,'In-year Trg Plan'!$D$4:$AV$67,50,FALSE)","v":"CO Parade"},null,null,{"$f":"HLOOKUP($C$3,'In-year Trg Plan'!$D$4:$AV$67,54,FALSE)","v":{"v":0,"d":"0.00"}},null,null,{"$f":"HLOOKUP($C$3,'In-year Trg Plan'!$D$4:$AV$67,58,FALSE)","v":{"v":0,"d":"0.00"}}]
[null,"PO Title",{"$f":"HLOOKUP($C$3,'In-year Trg Plan'!$D$4:$AV$67,51,FALSE)","v":"CO's Parade"},null,null,{"$f":"HLOOKUP($C$3,'In-year Trg Plan'!$D$4:$AV$67,55,FALSE)","v":{"$error":"#N/A"}},null,null,{"$f":"HLOOKUP($C$3,'In-year Trg Plan'!$D$4:$AV$67,59,FALSE)","v":{"$error":"#N/A"}}]
[null,"Instructor",{"$f":"HLOOKUP($C$3,'In-year Trg Plan'!$D$4:$AV$67,52,FALSE)","v":"CO"},null,null,{"$f":"HLOOKUP($C$3,'In-year Trg Plan'!$D$4:$AV$67,56,FALSE)","v":{"$error":"#N/A"}},null,null,{"$f":"HLOOKUP($C$3,'In-year Trg Plan'!$D$4:$AV$67,60,FALSE)","v":{"$error":"#N/A"}}]
[null,"Location",{"$f":"HLOOKUP($C$3,'In-year Trg Plan'!$D$4:$AV$67,53,FALSE)","v":"Parking Lot"},null,null,{"$f":"HLOOKUP($C$3,'In-year Trg Plan'!$D$4:$AV$67,57,FALSE)","v":{"$error":"#N/A"}},null,null,{"$f":"HLOOKUP($C$3,'In-year Trg Plan'!$D$4:$AV$67,61,FALSE)","v":{"$error":"#N/A"}}]
[]
[{"$f":"CONCATENATE(\"Weekly Activities \",TEXT(C3+1,\"d mmm yy\"),\" to \",TEXT(C3+7,\"d mmm yy\"))","v":"Weekly Activities 27 Mar 20 to 2 Apr 20"}]
[]
["Date","Day","Start","Finish","Activity",null,null,"Location",null,"Dress","OPI",null,null,"Cancelled","Enter anything in a cell to the left  to mark the activity as cancelled for the week.  Delete entry to \"un-cancel\" for subsequent weeks."]
[{"$f":"IF(ISBLANK($N50),IFERROR(INDEX('Weekly Trg'!$A$4:$N$79,SMALL(IF(('Weekly Trg'!$A$4:$A$79<$C$3+7)*(($C$3+7)<='Weekly Trg'!$B$4:$B$79),ROW('Weekly Trg'!$A$4:$A$79)),ROW(1:1))-3,13)+$C$3,\"\"),\"CANCELLED\")","v":"2020-03-30"},{"$f":"IFERROR(INDEX('Weekly Trg'!$A$4:$L$79,SMALL(IF(('Weekly Trg'!$A$4:$A$79<$C$3+7)*(($C$3+7)<='Weekly Trg'!$B$4:$B$79),ROW('Weekly Trg'!$A$4:$A$79)),ROW(1:1))-3,3),\"\")","v":"Mon"},{"$f":"IF(ISBLANK($N50),IFERROR(INDEX('Weekly Trg'!$A$4:$L$79,SMALL(IF(('Weekly Trg'!$A$4:$A$79<$C$3+7)*(($C$3+7)<='Weekly Trg'!$B$4:$B$79),ROW('Weekly Trg'!$A$4:$A$79)),ROW(1:1))-3,4),\"\"),\"-\")","v":"16:00:00"},{"$f":"IF(ISBLANK($N50),IFERROR(INDEX('Weekly Trg'!$A$4:$L$79,SMALL(IF(('Weekly Trg'!$A$4:$A$79<$C$3+7)*(($C$3+7)<='Weekly Trg'!$B$4:$B$79),ROW('Weekly Trg'!$A$4:$A$79)),ROW(1:1))-3,5),\"\"),\"-\")","v":"18:30:00"},{"$f":"IFERROR(INDEX('Weekly Trg'!$A$4:$L$79,SMALL(IF(('Weekly Trg'!$A$4:$A$79<$C$3+7)*(($C$3+7)<='Weekly Trg'!$B$4:$B$79),ROW('Weekly Trg'!$A$4:$A$79)),ROW(1:1))-3,6),\"\")","v":"Drill Practice"},null,null,{"$f":"IF(ISBLANK($N50),IFERROR(INDEX('Weekly Trg'!$A$4:$L$79,SMALL(IF(('Weekly Trg'!$A$4:$A$79<$C$3+7)*(($C$3+7)<='Weekly Trg'!$B$4:$B$79),ROW('Weekly Trg'!$A$4:$A$79)),ROW(1:1))-3,9),\"\"),\"-----\")","v":"MDVA"},null,{"$f":"IF(ISBLANK($N50),IFERROR(INDEX('Weekly Trg'!$A$4:$L$79,SMALL(IF(('Weekly Trg'!$A$4:$A$79<$C$3+7)*(($C$3+7)<='Weekly Trg'!$B$4:$B$79),ROW('Weekly Trg'!$A$4:$A$79)),ROW(1:1))-3,11),\"\"),\"-\")","v":"Civvies"},{"$f":"IFERROR(INDEX('Weekly Trg'!$A$4:$L$79,SMALL(IF(('Weekly Trg'!$A$4:$A$79<$C$3+7)*(($C$3+7)<='Weekly Trg'!$B$4:$B$79),ROW('Weekly Trg'!$A$4:$A$79)),ROW(1:1))-3,12),\"\")","v":"Capt. Carlsen"}]
[{"$f":"IF(ISBLANK(N51),IFERROR(INDEX('Weekly Trg'!$A$4:$N$79,SMALL(IF(('Weekly Trg'!$A$4:$A$79<$C$3+7)*(($C$3+7)<='Weekly Trg'!$B$4:$B$79),ROW('Weekly Trg'!$A$4:$A$79)),ROW(2:2))-3,13)+$C$3,\"\"),\"CANCELLED\")","v":""},{"$f":"IFERROR(INDEX('Weekly Trg'!$A$4:$L$79,SMALL(IF(('Weekly Trg'!$A$4:$A$79<$C$3+7)*(($C$3+7)<='Weekly Trg'!$B$4:$B$79),ROW('Weekly Trg'!$A$4:$A$79)),ROW(2:2))-3,3),\"\")","v":""},{"$f":"IF(ISBLANK($N51),IFERROR(INDEX('Weekly Trg'!$A$4:$L$79,SMALL(IF(('Weekly Trg'!$A$4:$A$79<$C$3+7)*(($C$3+7)<='Weekly Trg'!$B$4:$B$79),ROW('Weekly Trg'!$A$4:$A$79)),ROW(2:2))-3,4),\"\"),\"-\")","v":""},{"$f":"IF(ISBLANK($N51),IFERROR(INDEX('Weekly Trg'!$A$4:$L$79,SMALL(IF(('Weekly Trg'!$A$4:$A$79<$C$3+7)*(($C$3+7)<='Weekly Trg'!$B$4:$B$79),ROW('Weekly Trg'!$A$4:$A$79)),ROW(2:2))-3,5),\"\"),\"-\")","v":""},{"$f":"IFERROR(INDEX('Weekly Trg'!$A$4:$L$79,SMALL(IF(('Weekly Trg'!$A$4:$A$79<$C$3+7)*(($C$3+7)<='Weekly Trg'!$B$4:$B$79),ROW('Weekly Trg'!$A$4:$A$79)),ROW(2:2))-3,6),\"\")","v":""},null,null,{"$f":"IF(ISBLANK($N51),IFERROR(INDEX('Weekly Trg'!$A$4:$L$79,SMALL(IF(('Weekly Trg'!$A$4:$A$79<$C$3+7)*(($C$3+7)<='Weekly Trg'!$B$4:$B$79),ROW('Weekly Trg'!$A$4:$A$79)),ROW(2:2))-3,9),\"\"),\"-----\")","v":""},null,{"$f":"IF(ISBLANK($N51),IFERROR(INDEX('Weekly Trg'!$A$4:$L$79,SMALL(IF(('Weekly Trg'!$A$4:$A$79<$C$3+7)*(($C$3+7)<='Weekly Trg'!$B$4:$B$79),ROW('Weekly Trg'!$A$4:$A$79)),ROW(2:2))-3,11),\"\"),\"-\")","v":""},{"$f":"IFERROR(INDEX('Weekly Trg'!$A$4:$L$79,SMALL(IF(('Weekly Trg'!$A$4:$A$79<$C$3+7)*(($C$3+7)<='Weekly Trg'!$B$4:$B$79),ROW('Weekly Trg'!$A$4:$A$79)),ROW(2:2))-3,12),\"\")","v":""}]
[{"$f":"IF(ISBLANK(N52),IFERROR(INDEX('Weekly Trg'!$A$4:$N$79,SMALL(IF(('Weekly Trg'!$A$4:$A$79<$C$3+7)*(($C$3+7)<='Weekly Trg'!$B$4:$B$79),ROW('Weekly Trg'!$A$4:$A$79)),ROW(3:3))-3,13)+$C$3,\"\"),\"CANCELLED\")","v":""},{"$f":"IFERROR(INDEX('Weekly Trg'!$A$4:$L$79,SMALL(IF(('Weekly Trg'!$A$4:$A$79<$C$3+7)*(($C$3+7)<='Weekly Trg'!$B$4:$B$79),ROW('Weekly Trg'!$A$4:$A$79)),ROW(3:3))-3,3),\"\")","v":""},{"$f":"IF(ISBLANK($N52),IFERROR(INDEX('Weekly Trg'!$A$4:$L$79,SMALL(IF(('Weekly Trg'!$A$4:$A$79<$C$3+7)*(($C$3+7)<='Weekly Trg'!$B$4:$B$79),ROW('Weekly Trg'!$A$4:$A$79)),ROW(3:3))-3,4),\"\"),\"-\")","v":""},{"$f":"IF(ISBLANK($N52),IFERROR(INDEX('Weekly Trg'!$A$4:$L$79,SMALL(IF(('Weekly Trg'!$A$4:$A$79<$C$3+7)*(($C$3+7)<='Weekly Trg'!$B$4:$B$79),ROW('Weekly Trg'!$A$4:$A$79)),ROW(3:3))-3,5),\"\"),\"-\")","v":""},{"$f":"IFERROR(INDEX('Weekly Trg'!$A$4:$L$79,SMALL(IF(('Weekly Trg'!$A$4:$A$79<$C$3+7)*(($C$3+7)<='Weekly Trg'!$B$4:$B$79),ROW('Weekly Trg'!$A$4:$A$79)),ROW(3:3))-3,6),\"\")","v":""},null,null,{"$f":"IF(ISBLANK($N52),IFERROR(INDEX('Weekly Trg'!$A$4:$L$79,SMALL(IF(('Weekly Trg'!$A$4:$A$79<$C$3+7)*(($C$3+7)<='Weekly Trg'!$B$4:$B$79),ROW('Weekly Trg'!$A$4:$A$79)),ROW(3:3))-3,9),\"\"),\"-----\")","v":""},null,{"$f":"IF(ISBLANK($N52),IFERROR(INDEX('Weekly Trg'!$A$4:$L$79,SMALL(IF(('Weekly Trg'!$A$4:$A$79<$C$3+7)*(($C$3+7)<='Weekly Trg'!$B$4:$B$79),ROW('Weekly Trg'!$A$4:$A$79)),ROW(3:3))-3,11),\"\"),\"-\")","v":""},{"$f":"IFERROR(INDEX('Weekly Trg'!$A$4:$L$79,SMALL(IF(('Weekly Trg'!$A$4:$A$79<$C$3+7)*(($C$3+7)<='Weekly Trg'!$B$4:$B$79),ROW('Weekly Trg'!$A$4:$A$79)),ROW(3:3))-3,12),\"\")","v":""}]
[{"$f":"IF(ISBLANK(N53),IFERROR(INDEX('Weekly Trg'!$A$4:$N$79,SMALL(IF(('Weekly Trg'!$A$4:$A$79<$C$3+7)*(($C$3+7)<='Weekly Trg'!$B$4:$B$79),ROW('Weekly Trg'!$A$4:$A$79)),ROW(4:4))-3,13)+$C$3,\"\"),\"CANCELLED\")","v":""},{"$f":"IFERROR(INDEX('Weekly Trg'!$A$4:$L$79,SMALL(IF(('Weekly Trg'!$A$4:$A$79<$C$3+7)*(($C$3+7)<='Weekly Trg'!$B$4:$B$79),ROW('Weekly Trg'!$A$4:$A$79)),ROW(4:4))-3,3),\"\")","v":""},{"$f":"IF(ISBLANK($N53),IFERROR(INDEX('Weekly Trg'!$A$4:$L$79,SMALL(IF(('Weekly Trg'!$A$4:$A$79<$C$3+7)*(($C$3+7)<='Weekly Trg'!$B$4:$B$79),ROW('Weekly Trg'!$A$4:$A$79)),ROW(4:4))-3,4),\"\"),\"-\")","v":""},{"$f":"IF(ISBLANK($N53),IFERROR(INDEX('Weekly Trg'!$A$4:$L$79,SMALL(IF(('Weekly Trg'!$A$4:$A$79<$C$3+7)*(($C$3+7)<='Weekly Trg'!$B$4:$B$79),ROW('Weekly Trg'!$A$4:$A$79)),ROW(4:4))-3,5),\"\"),\"-\")","v":""},{"$f":"IFERROR(INDEX('Weekly Trg'!$A$4:$L$79,SMALL(IF(('Weekly Trg'!$A$4:$A$79<$C$3+7)*(($C$3+7)<='Weekly Trg'!$B$4:$B$79),ROW('Weekly Trg'!$A$4:$A$79)),ROW(4:4))-3,6),\"\")","v":""},null,null,{"$f":"IF(ISBLANK($N53),IFERROR(INDEX('Weekly Trg'!$A$4:$L$79,SMALL(IF(('Weekly Trg'!$A$4:$A$79<$C$3+7)*(($C$3+7)<='Weekly Trg'!$B$4:$B$79),ROW('Weekly Trg'!$A$4:$A$79)),ROW(4:4))-3,9),\"\"),\"-----\")","v":""},null,{"$f":"IF(ISBLANK($N53),IFERROR(INDEX('Weekly Trg'!$A$4:$L$79,SMALL(IF(('Weekly Trg'!$A$4:$A$79<$C$3+7)*(($C$3+7)<='Weekly Trg'!$B$4:$B$79),ROW('Weekly Trg'!$A$4:$A$79)),ROW(4:4))-3,11),\"\"),\"-\")","v":""},{"$f":"IFERROR(INDEX('Weekly Trg'!$A$4:$L$79,SMALL(IF(('Weekly Trg'!$A$4:$A$79<$C$3+7)*(($C$3+7)<='Weekly Trg'!$B$4:$B$79),ROW('Weekly Trg'!$A$4:$A$79)),ROW(4:4))-3,12),\"\")","v":""}]
[{"$f":"IF(ISBLANK(N54),IFERROR(INDEX('Weekly Trg'!$A$4:$N$79,SMALL(IF(('Weekly Trg'!$A$4:$A$79<$C$3+7)*(($C$3+7)<='Weekly Trg'!$B$4:$B$79),ROW('Weekly Trg'!$A$4:$A$79)),ROW(5:5))-3,13)+$C$3,\"\"),\"CANCELLED\")","v":""},{"$f":"IFERROR(INDEX('Weekly Trg'!$A$4:$L$79,SMALL(IF(('Weekly Trg'!$A$4:$A$79<$C$3+7)*(($C$3+7)<='Weekly Trg'!$B$4:$B$79),ROW('Weekly Trg'!$A$4:$A$79)),ROW(5:5))-3,3),\"\")","v":""},{"$f":"IF(ISBLANK($N54),IFERROR(INDEX('Weekly Trg'!$A$4:$L$79,SMALL(IF(('Weekly Trg'!$A$4:$A$79<$C$3+7)*(($C$3+7)<='Weekly Trg'!$B$4:$B$79),ROW('Weekly Trg'!$A$4:$A$79)),ROW(5:5))-3,4),\"\"),\"-\")","v":""},{"$f":"IF(ISBLANK($N54),IFERROR(INDEX('Weekly Trg'!$A$4:$L$79,SMALL(IF(('Weekly Trg'!$A$4:$A$79<$C$3+7)*(($C$3+7)<='Weekly Trg'!$B$4:$B$79),ROW('Weekly Trg'!$A$4:$A$79)),ROW(5:5))-3,5),\"\"),\"-\")","v":""},{"$f":"IFERROR(INDEX('Weekly Trg'!$A$4:$L$79,SMALL(IF(('Weekly Trg'!$A$4:$A$79<$C$3+7)*(($C$3+7)<='Weekly Trg'!$B$4:$B$79),ROW('Weekly Trg'!$A$4:$A$79)),ROW(5:5))-3,6),\"\")","v":""},null,null,{"$f":"IF(ISBLANK($N54),IFERROR(INDEX('Weekly Trg'!$A$4:$L$79,SMALL(IF(('Weekly Trg'!$A$4:$A$79<$C$3+7)*(($C$3+7)<='Weekly Trg'!$B$4:$B$79),ROW('Weekly Trg'!$A$4:$A$79)),ROW(5:5))-3,9),\"\"),\"-----\")","v":""},null,{"$f":"IF(ISBLANK($N54),IFERROR(INDEX('Weekly Trg'!$A$4:$L$79,SMALL(IF(('Weekly Trg'!$A$4:$A$79<$C$3+7)*(($C$3+7)<='Weekly Trg'!$B$4:$B$79),ROW('Weekly Trg'!$A$4:$A$79)),ROW(5:5))-3,11),\"\"),\"-\")","v":""},{"$f":"IFERROR(INDEX('Weekly Trg'!$A$4:$L$79,SMALL(IF(('Weekly Trg'!$A$4:$A$79<$C$3+7)*(($C$3+7)<='Weekly Trg'!$B$4:$B$79),ROW('Weekly Trg'!$A$4:$A$79)),ROW(5:5))-3,12),\"\")","v":""}]
[{"$f":"IF(ISBLANK(N55),IFERROR(INDEX('Weekly Trg'!$A$4:$N$79,SMALL(IF(('Weekly Trg'!$A$4:$A$79<$C$3+7)*(($C$3+7)<='Weekly Trg'!$B$4:$B$79),ROW('Weekly Trg'!$A$4:$A$79)),ROW(6:6))-3,13)+$C$3,\"\"),\"CANCELLED\")","v":""},{"$f":"IFERROR(INDEX('Weekly Trg'!$A$4:$L$79,SMALL(IF(('Weekly Trg'!$A$4:$A$79<$C$3+7)*(($C$3+7)<='Weekly Trg'!$B$4:$B$79),ROW('Weekly Trg'!$A$4:$A$79)),ROW(6:6))-3,3),\"\")","v":""},{"$f":"IF(ISBLANK($N55),IFERROR(INDEX('Weekly Trg'!$A$4:$L$79,SMALL(IF(('Weekly Trg'!$A$4:$A$79<$C$3+7)*(($C$3+7)<='Weekly Trg'!$B$4:$B$79),ROW('Weekly Trg'!$A$4:$A$79)),ROW(6:6))-3,4),\"\"),\"-\")","v":""},{"$f":"IF(ISBLANK($N55),IFERROR(INDEX('Weekly Trg'!$A$4:$L$79,SMALL(IF(('Weekly Trg'!$A$4:$A$79<$C$3+7)*(($C$3+7)<='Weekly Trg'!$B$4:$B$79),ROW('Weekly Trg'!$A$4:$A$79)),ROW(6:6))-3,5),\"\"),\"-\")","v":""},{"$f":"IFERROR(INDEX('Weekly Trg'!$A$4:$L$79,SMALL(IF(('Weekly Trg'!$A$4:$A$79<$C$3+7)*(($C$3+7)<='Weekly Trg'!$B$4:$B$79),ROW('Weekly Trg'!$A$4:$A$79)),ROW(6:6))-3,6),\"\")","v":""},null,null,{"$f":"IF(ISBLANK($N55),IFERROR(INDEX('Weekly Trg'!$A$4:$L$79,SMALL(IF(('Weekly Trg'!$A$4:$A$79<$C$3+7)*(($C$3+7)<='Weekly Trg'!$B$4:$B$79),ROW('Weekly Trg'!$A$4:$A$79)),ROW(6:6))-3,9),\"\"),\"-----\")","v":""},null,{"$f":"IF(ISBLANK($N55),IFERROR(INDEX('Weekly Trg'!$A$4:$L$79,SMALL(IF(('Weekly Trg'!$A$4:$A$79<$C$3+7)*(($C$3+7)<='Weekly Trg'!$B$4:$B$79),ROW('Weekly Trg'!$A$4:$A$79)),ROW(6:6))-3,11),\"\"),\"-\")","v":""},{"$f":"IFERROR(INDEX('Weekly Trg'!$A$4:$L$79,SMALL(IF(('Weekly Trg'!$A$4:$A$79<$C$3+7)*(($C$3+7)<='Weekly Trg'!$B$4:$B$79),ROW('Weekly Trg'!$A$4:$A$79)),ROW(6:6))-3,12),\"\")","v":""}]
[{"$f":"IF(ISBLANK(N56),IFERROR(INDEX('Weekly Trg'!$A$4:$N$79,SMALL(IF(('Weekly Trg'!$A$4:$A$79<$C$3+7)*(($C$3+7)<='Weekly Trg'!$B$4:$B$79),ROW('Weekly Trg'!$A$4:$A$79)),ROW(7:7))-3,13)+$C$3,\"\"),\"CANCELLED\")","v":""},{"$f":"IFERROR(INDEX('Weekly Trg'!$A$4:$L$79,SMALL(IF(('Weekly Trg'!$A$4:$A$79<$C$3+7)*(($C$3+7)<='Weekly Trg'!$B$4:$B$79),ROW('Weekly Trg'!$A$4:$A$79)),ROW(7:7))-3,3),\"\")","v":""},{"$f":"IF(ISBLANK($N56),IFERROR(INDEX('Weekly Trg'!$A$4:$L$79,SMALL(IF(('Weekly Trg'!$A$4:$A$79<$C$3+7)*(($C$3+7)<='Weekly Trg'!$B$4:$B$79),ROW('Weekly Trg'!$A$4:$A$79)),ROW(7:7))-3,4),\"\"),\"-\")","v":""},{"$f":"IF(ISBLANK($N56),IFERROR(INDEX('Weekly Trg'!$A$4:$L$79,SMALL(IF(('Weekly Trg'!$A$4:$A$79<$C$3+7)*(($C$3+7)<='Weekly Trg'!$B$4:$B$79),ROW('Weekly Trg'!$A$4:$A$79)),ROW(7:7))-3,5),\"\"),\"-\")","v":""},{"$f":"IFERROR(INDEX('Weekly Trg'!$A$4:$L$79,SMALL(IF(('Weekly Trg'!$A$4:$A$79<$C$3+7)*(($C$3+7)<='Weekly Trg'!$B$4:$B$79),ROW('Weekly Trg'!$A$4:$A$79)),ROW(7:7))-3,6),\"\")","v":""},null,null,{"$f":"IF(ISBLANK($N56),IFERROR(INDEX('Weekly Trg'!$A$4:$L$79,SMALL(IF(('Weekly Trg'!$A$4:$A$79<$C$3+7)*(($C$3+7)<='Weekly Trg'!$B$4:$B$79),ROW('Weekly Trg'!$A$4:$A$79)),ROW(7:7))-3,9),\"\"),\"-----\")","v":""},null,{"$f":"IF(ISBLANK($N56),IFERROR(INDEX('Weekly Trg'!$A$4:$L$79,SMALL(IF(('Weekly Trg'!$A$4:$A$79<$C$3+7)*(($C$3+7)<='Weekly Trg'!$B$4:$B$79),ROW('Weekly Trg'!$A$4:$A$79)),ROW(7:7))-3,11),\"\"),\"-\")","v":""},{"$f":"IFERROR(INDEX('Weekly Trg'!$A$4:$L$79,SMALL(IF(('Weekly Trg'!$A$4:$A$79<$C$3+7)*(($C$3+7)<='Weekly Trg'!$B$4:$B$79),ROW('Weekly Trg'!$A$4:$A$79)),ROW(7:7))-3,12),\"\")","v":""}]
[{"$f":"IF(ISBLANK(N57),IFERROR(INDEX('Weekly Trg'!$A$4:$N$79,SMALL(IF(('Weekly Trg'!$A$4:$A$79<$C$3+7)*(($C$3+7)<='Weekly Trg'!$B$4:$B$79),ROW('Weekly Trg'!$A$4:$A$79)),ROW(8:8))-3,13)+$C$3,\"\"),\"CANCELLED\")","v":""},{"$f":"IFERROR(INDEX('Weekly Trg'!$A$4:$L$79,SMALL(IF(('Weekly Trg'!$A$4:$A$79<$C$3+7)*(($C$3+7)<='Weekly Trg'!$B$4:$B$79),ROW('Weekly Trg'!$A$4:$A$79)),ROW(8:8))-3,3),\"\")","v":""},{"$f":"IF(ISBLANK($N57),IFERROR(INDEX('Weekly Trg'!$A$4:$L$79,SMALL(IF(('Weekly Trg'!$A$4:$A$79<$C$3+7)*(($C$3+7)<='Weekly Trg'!$B$4:$B$79),ROW('Weekly Trg'!$A$4:$A$79)),ROW(8:8))-3,4),\"\"),\"-\")","v":""},{"$f":"IF(ISBLANK($N57),IFERROR(INDEX('Weekly Trg'!$A$4:$L$79,SMALL(IF(('Weekly Trg'!$A$4:$A$79<$C$3+7)*(($C$3+7)<='Weekly Trg'!$B$4:$B$79),ROW('Weekly Trg'!$A$4:$A$79)),ROW(8:8))-3,5),\"\"),\"-\")","v":""},{"$f":"IFERROR(INDEX('Weekly Trg'!$A$4:$L$79,SMALL(IF(('Weekly Trg'!$A$4:$A$79<$C$3+7)*(($C$3+7)<='Weekly Trg'!$B$4:$B$79),ROW('Weekly Trg'!$A$4:$A$79)),ROW(8:8))-3,6),\"\")","v":""},null,null,{"$f":"IF(ISBLANK($N57),IFERROR(INDEX('Weekly Trg'!$A$4:$L$79,SMALL(IF(('Weekly Trg'!$A$4:$A$79<$C$3+7)*(($C$3+7)<='Weekly Trg'!$B$4:$B$79),ROW('Weekly Trg'!$A$4:$A$79)),ROW(8:8))-3,9),\"\"),\"-----\")","v":""},null,{"$f":"IF(ISBLANK($N57),IFERROR(INDEX('Weekly Trg'!$A$4:$L$79,SMALL(IF(('Weekly Trg'!$A$4:$A$79<$C$3+7)*(($C$3+7)<='Weekly Trg'!$B$4:$B$79),ROW('Weekly Trg'!$A$4:$A$79)),ROW(8:8))-3,11),\"\"),\"-\")","v":""},{"$f":"IFERROR(INDEX('Weekly Trg'!$A$4:$L$79,SMALL(IF(('Weekly Trg'!$A$4:$A$79<$C$3+7)*(($C$3+7)<='Weekly Trg'!$B$4:$B$79),ROW('Weekly Trg'!$A$4:$A$79)),ROW(8:8))-3,12),\"\")","v":""}]
[{"$f":"IF(ISBLANK(N58),IFERROR(INDEX('Weekly Trg'!$A$4:$N$79,SMALL(IF(('Weekly Trg'!$A$4:$A$79<$C$3+7)*(($C$3+7)<='Weekly Trg'!$B$4:$B$79),ROW('Weekly Trg'!$A$4:$A$79)),ROW(9:9))-3,13)+$C$3,\"\"),\"CANCELLED\")","v":""},{"$f":"IFERROR(INDEX('Weekly Trg'!$A$4:$L$79,SMALL(IF(('Weekly Trg'!$A$4:$A$79<$C$3+7)*(($C$3+7)<='Weekly Trg'!$B$4:$B$79),ROW('Weekly Trg'!$A$4:$A$79)),ROW(9:9))-3,3),\"\")","v":""},{"$f":"IF(ISBLANK($N58),IFERROR(INDEX('Weekly Trg'!$A$4:$L$79,SMALL(IF(('Weekly Trg'!$A$4:$A$79<$C$3+7)*(($C$3+7)<='Weekly Trg'!$B$4:$B$79),ROW('Weekly Trg'!$A$4:$A$79)),ROW(9:9))-3,4),\"\"),\"-\")","v":""},{"$f":"IF(ISBLANK($N58),IFERROR(INDEX('Weekly Trg'!$A$4:$L$79,SMALL(IF(('Weekly Trg'!$A$4:$A$79<$C$3+7)*(($C$3+7)<='Weekly Trg'!$B$4:$B$79),ROW('Weekly Trg'!$A$4:$A$79)),ROW(9:9))-3,5),\"\"),\"-\")","v":""},{"$f":"IFERROR(INDEX('Weekly Trg'!$A$4:$L$79,SMALL(IF(('Weekly Trg'!$A$4:$A$79<$C$3+7)*(($C$3+7)<='Weekly Trg'!$B$4:$B$79),ROW('Weekly Trg'!$A$4:$A$79)),ROW(9:9))-3,6),\"\")","v":""},null,null,{"$f":"IF(ISBLANK($N58),IFERROR(INDEX('Weekly Trg'!$A$4:$L$79,SMALL(IF(('Weekly Trg'!$A$4:$A$79<$C$3+7)*(($C$3+7)<='Weekly Trg'!$B$4:$B$79),ROW('Weekly Trg'!$A$4:$A$79)),ROW(9:9))-3,9),\"\"),\"-----\")","v":""},null,{"$f":"IF(ISBLANK($N58),IFERROR(INDEX('Weekly Trg'!$A$4:$L$79,SMALL(IF(('Weekly Trg'!$A$4:$A$79<$C$3+7)*(($C$3+7)<='Weekly Trg'!$B$4:$B$79),ROW('Weekly Trg'!$A$4:$A$79)),ROW(9:9))-3,11),\"\"),\"-\")","v":""},{"$f":"IFERROR(INDEX('Weekly Trg'!$A$4:$L$79,SMALL(IF(('Weekly Trg'!$A$4:$A$79<$C$3+7)*(($C$3+7)<='Weekly Trg'!$B$4:$B$79),ROW('Weekly Trg'!$A$4:$A$79)),ROW(9:9))-3,12),\"\")","v":""}]
[{"$f":"IF(ISBLANK(N59),IFERROR(INDEX('Weekly Trg'!$A$4:$N$79,SMALL(IF(('Weekly Trg'!$A$4:$A$79<$C$3+7)*(($C$3+7)<='Weekly Trg'!$B$4:$B$79),ROW('Weekly Trg'!$A$4:$A$79)),ROW(10:10))-3,13)+$C$3,\"\"),\"CANCELLED\")","v":""},{"$f":"IFERROR(INDEX('Weekly Trg'!$A$4:$L$79,SMALL(IF(('Weekly Trg'!$A$4:$A$79<$C$3+7)*(($C$3+7)<='Weekly Trg'!$B$4:$B$79),ROW('Weekly Trg'!$A$4:$A$79)),ROW(10:10))-3,3),\"\")","v":""},{"$f":"IF(ISBLANK($N59),IFERROR(INDEX('Weekly Trg'!$A$4:$L$79,SMALL(IF(('Weekly Trg'!$A$4:$A$79<$C$3+7)*(($C$3+7)<='Weekly Trg'!$B$4:$B$79),ROW('Weekly Trg'!$A$4:$A$79)),ROW(10:10))-3,4),\"\"),\"-\")","v":""},{"$f":"IF(ISBLANK($N59),IFERROR(INDEX('Weekly Trg'!$A$4:$L$79,SMALL(IF(('Weekly Trg'!$A$4:$A$79<$C$3+7)*(($C$3+7)<='Weekly Trg'!$B$4:$B$79),ROW('Weekly Trg'!$A$4:$A$79)),ROW(10:10))-3,5),\"\"),\"-\")","v":""},{"$f":"IFERROR(INDEX('Weekly Trg'!$A$4:$L$79,SMALL(IF(('Weekly Trg'!$A$4:$A$79<$C$3+7)*(($C$3+7)<='Weekly Trg'!$B$4:$B$79),ROW('Weekly Trg'!$A$4:$A$79)),ROW(10:10))-3,6),\"\")","v":""},null,null,{"$f":"IF(ISBLANK($N59),IFERROR(INDEX('Weekly Trg'!$A$4:$L$79,SMALL(IF(('Weekly Trg'!$A$4:$A$79<$C$3+7)*(($C$3+7)<='Weekly Trg'!$B$4:$B$79),ROW('Weekly Trg'!$A$4:$A$79)),ROW(10:10))-3,9),\"\"),\"-----\")","v":""},null,{"$f":"IF(ISBLANK($N59),IFERROR(INDEX('Weekly Trg'!$A$4:$L$79,SMALL(IF(('Weekly Trg'!$A$4:$A$79<$C$3+7)*(($C$3+7)<='Weekly Trg'!$B$4:$B$79),ROW('Weekly Trg'!$A$4:$A$79)),ROW(10:10))-3,11),\"\"),\"-\")","v":""},{"$f":"IFERROR(INDEX('Weekly Trg'!$A$4:$L$79,SMALL(IF(('Weekly Trg'!$A$4:$A$79<$C$3+7)*(($C$3+7)<='Weekly Trg'!$B$4:$B$79),ROW('Weekly Trg'!$A$4:$A$79)),ROW(10:10))-3,12),\"\")","v":""}]
{"$rows_empty":7}
["Upcoming Activities"]
[]
["Activity Start",null,"Activity End",null,"Activity",null,null,"Location",null,"Dress","OPI"]
[{"$f":"IFERROR(INDEX('Other Activities'!$A$4:$I$102,SMALL(IF(('Other Activities'!$A$4:$A$102<$C$3+50-WEEKDAY($C$3,1))*($C$3<'Other Activities'!$A$4:$A$102),ROW('Other Activities'!$A$4:$A$102)),ROW(1:1))-3,3),\"\")","v":"16:30:00"},{"$f":"IFERROR(INDEX('Other Activities'!$A$4:$I$102,SMALL(IF(('Other Activities'!$A$4:$A$102<$C$3+50-WEEKDAY($C$3,1))*($C$3<'Other Activities'!$A$4:$A$102),ROW('Other Activities'!$A$4:$A$102)),ROW(1:1))-3,1),\"\")","v":"2020-04-14"},{"$f":"IFERROR(INDEX('Other Activities'!$A$4:$I$102,SMALL(IF(('Other Activities'!$A$4:$A$102<$C$3+50-WEEKDAY($C$3,1))*($C$3<'Other Activities'!$A$4:$A$102),ROW('Other Activities'!$A$4:$A$102)),ROW(1:1))-3,5),\"\")","v":"19:00:00"},{"$f":"IFERROR(INDEX('Other Activities'!$A$4:$I$102,SMALL(IF(('Other Activities'!$A$4:$A$102<$C$3+50-WEEKDAY($C$3,1))*($C$3<'Other Activities'!$A$4:$A$102),ROW('Other Activities'!$A$4:$A$102)),ROW(1:1))-3,4),\"\")","v":"2020-04-14"},{"$f":"IFERROR(INDEX('Other Activities'!$A$4:$I$102,SMALL(IF(('Other Activities'!$A$4:$A$102<$C$3+50-WEEKDAY($C$3,1))*($C$3<'Other Activities'!$A$4:$A$102),ROW('Other Activities'!$A$4:$A$102)),ROW(1:1))-3,6),\"\")","v":"Bowling Night"},null,null,{"$f":"IFERROR(INDEX('Other Activities'!$A$4:$I$102,SMALL(IF(('Other Activities'!$A$4:$A$102<$C$3+50-WEEKDAY($C$3,1))*($C$3<'Other Activities'!$A$4:$A$102),ROW('Other Activities'!$A$4:$A$102)),ROW(1:1))-3,7),\"\")","v":"Markham Bowl"},null,{"$f":"IFERROR(INDEX('Other Activities'!$A$4:$I$102,SMALL(IF(('Other Activities'!$A$4:$A$102<$C$3+50-WEEKDAY($C$3,1))*($C$3<'Other Activities'!$A$4:$A$102),ROW('Other Activities'!$A$4:$A$102)),ROW(1:1))-3,8),\"\")","v":"FTU"},{"$f":"IFERROR(INDEX('Other Activities'!$A$4:$I$102,SMALL(IF(('Other Activities'!$A$4:$A$102<$C$3+50-WEEKDAY($C$3,1))*($C$3<'Other Activities'!$A$4:$A$102),ROW('Other Activities'!$A$4:$A$102)),ROW(1:1))-3,9),\"\")","v":"Capt Carlsen"}]
[{"$f":"IFERROR(INDEX('Other Activities'!$A$4:$I$102,SMALL(IF(('Other Activities'!$A$4:$A$102<$C$3+50-WEEKDAY($C$3,1))*($C$3<'Other Activities'!$A$4:$A$102),ROW('Other Activities'!$A$4:$A$102)),ROW(2:2))-3,3),\"\")","v":"09:00:00"},{"$f":"IFERROR(INDEX('Other Activities'!$A$4:$I$102,SMALL(IF(('Other Activities'!$A$4:$A$102<$C$3+50-WEEKDAY($C$3,1))*($C$3<'Other Activities'!$A$4:$A$102),ROW('Other Activities'!$A$4:$A$102)),ROW(2:2))-3,1),\"\")","v":"2020-04-25"},{"$f":"IFERROR(INDEX('Other Activities'!$A$4:$I$102,SMALL(IF(('Other Activities'!$A$4:$A$102<$C$3+50-WEEKDAY($C$3,1))*($C$3<'Other Activities'!$A$4:$A$102),ROW('Other Activities'!$A$4:$A$102)),ROW(2:2))-3,5),\"\")","v":"14:00:00"},{"$f":"IFERROR(INDEX('Other Activities'!$A$4:$I$102,SMALL(IF(('Other Activities'!$A$4:$A$102<$C$3+50-WEEKDAY($C$3,1))*($C$3<'Other Activities'!$A$4:$A$102),ROW('Other Activities'!$A$4:$A$102)),ROW(2:2))-3,4),\"\")","v":"2020-04-25"},{"$f":"IFERROR(INDEX('Other Activities'!$A$4:$I$102,SMALL(IF(('Other Activities'!$A$4:$A$102<$C$3+50-WEEKDAY($C$3,1))*($C$3<'Other Activities'!$A$4:$A$102),ROW('Other Activities'!$A$4:$A$102)),ROW(2:2))-3,6),\"\")","v":"Clean Up the Rouge"},null,null,{"$f":"IFERROR(INDEX('Other Activities'!$A$4:$I$102,SMALL(IF(('Other Activities'!$A$4:$A$102<$C$3+50-WEEKDAY($C$3,1))*($C$3<'Other Activities'!$A$4:$A$102),ROW('Other Activities'!$A$4:$A$102)),ROW(2:2))-3,7),\"\")","v":"MDVA"},null,{"$f":"IFERROR(INDEX('Other Activities'!$A$4:$I$102,SMALL(IF(('Other Activities'!$A$4:$A$102<$C$3+50-WEEKDAY($C$3,1))*($C$3<'Other Activities'!$A$4:$A$102),ROW('Other Activities'!$A$4:$A$102)),ROW(2:2))-3,8),\"\")","v":"FTU"},{"$f":"IFERROR(INDEX('Other Activities'!$A$4:$I$102,SMALL(IF(('Other Activities'!$A$4:$A$102<$C$3+50-WEEKDAY($C$3,1))*($C$3<'Other Activities'!$A$4:$A$102),ROW('Other Activities'!$A$4:$A$102)),ROW(2:2))-3,9),\"\")","v":"Capt Stagg"}]
[{"$f":"IFERROR(INDEX('Other Activities'!$A$4:$I$102,SMALL(IF(('Other Activities'!$A$4:$A$102<$C$3+50-WEEKDAY($C$3,1))*($C$3<'Other Activities'!$A$4:$A$102),ROW('Other Activities'!$A$4:$A$102)),ROW(3:3))-3,3),\"\")","v":"18:00:00"},{"$f":"IFERROR(INDEX('Other Activities'!$A$4:$I$102,SMALL(IF(('Other Activities'!$A$4:$A$102<$C$3+50-WEEKDAY($C$3,1))*($C$3<'Other Activities'!$A$4:$A$102),ROW('Other Activities'!$A$4:$A$102)),ROW(3:3))-3,1),\"\")","v":"2020-05-01"},{"$f":"IFERROR(INDEX('Other Activities'!$A$4:$I$102,SMALL(IF(('Other Activities'!$A$4:$A$102<$C$3+50-WEEKDAY($C$3,1))*($C$3<'Other Activities'!$A$4:$A$102),ROW('Other Activities'!$A$4:$A$102)),ROW(3:3))-3,5),\"\")","v":"14:00:00"},{"$f":"IFERROR(INDEX('Other Activities'!$A$4:$I$102,SMALL(IF(('Other Activities'!$A$4:$A$102<$C$3+50-WEEKDAY($C$3,1))*($C$3<'Other Activities'!$A$4:$A$102),ROW('Other Activities'!$A$4:$A$102)),ROW(3:3))-3,4),\"\")","v":"2020-05-03"},{"$f":"IFERROR(INDEX('Other Activities'!$A$4:$I$102,SMALL(IF(('Other Activities'!$A$4:$A$102<$C$3+50-WEEKDAY($C$3,1))*($C$3<'Other Activities'!$A$4:$A$102),ROW('Other Activities'!$A$4:$A$102)),ROW(3:3))-3,6),\"\")","v":"Nav/Trek "},null,null,{"$f":"IFERROR(INDEX('Other Activities'!$A$4:$I$102,SMALL(IF(('Other Activities'!$A$4:$A$102<$C$3+50-WEEKDAY($C$3,1))*($C$3<'Other Activities'!$A$4:$A$102),ROW('Other Activities'!$A$4:$A$102)),ROW(3:3))-3,7),\"\")","v":"Woodland Trails Scout Camp"},null,{"$f":"IFERROR(INDEX('Other Activities'!$A$4:$I$102,SMALL(IF(('Other Activities'!$A$4:$A$102<$C$3+50-WEEKDAY($C$3,1))*($C$3<'Other Activities'!$A$4:$A$102),ROW('Other Activities'!$A$4:$A$102)),ROW(3:3))-3,8),\"\")","v":"FTU"},{"$f":"IFERROR(INDEX('Other Activities'!$A$4:$I$102,SMALL(IF(('Other Activities'!$A$4:$A$102<$C$3+50-WEEKDAY($C$3,1))*($C$3<'Other Activities'!$A$4:$A$102),ROW('Other Activities'!$A$4:$A$102)),ROW(3:3))-3,9),\"\")","v":"Lt Heaton"}]
[{"$f":"IFERROR(INDEX('Other Activities'!$A$4:$I$102,SMALL(IF(('Other Activities'!$A$4:$A$102<$C$3+50-WEEKDAY($C$3,1))*($C$3<'Other Activities'!$A$4:$A$102),ROW('Other Activities'!$A$4:$A$102)),ROW(4:4))-3,3),\"\")","v":"09:00:00"},{"$f":"IFERROR(INDEX('Other Activities'!$A$4:$I$102,SMALL(IF(('Other Activities'!$A$4:$A$102<$C$3+50-WEEKDAY($C$3,1))*($C$3<'Other Activities'!$A$4:$A$102),ROW('Other Activities'!$A$4:$A$102)),ROW(4:4))-3,1),\"\")","v":"2020-05-09"},{"$f":"IFERROR(INDEX('Other Activities'!$A$4:$I$102,SMALL(IF(('Other Activities'!$A$4:$A$102<$C$3+50-WEEKDAY($C$3,1))*($C$3<'Other Activities'!$A$4:$A$102),ROW('Other Activities'!$A$4:$A$102)),ROW(4:4))-3,5),\"\")","v":"14:00:00"},{"$f":"IFERROR(INDEX('Other Activities'!$A$4:$I$102,SMALL(IF(('Other Activities'!$A$4:$A$102<$C$3+50-WEEKDAY($C$3,1))*($C$3<'Other Activities'!$A$4:$A$102),ROW('Other Activities'!$A$4:$A$102)),ROW(4:4))-3,4),\"\")","v":"2020-05-09"},{"$f":"IFERROR(INDEX('Other Activities'!$A$4:$I$102,SMALL(IF(('Other Activities'!$A$4:$A$102<$C$3+50-WEEKDAY($C$3,1))*($C$3<'Other Activities'!$A$4:$A$102),ROW('Other Activities'!$A$4:$A$102)),ROW(4:4))-3,6),\"\")","v":"Treetop Trekking"},null,null,{"$f":"IFERROR(INDEX('Other Activities'!$A$4:$I$102,SMALL(IF(('Other Activities'!$A$4:$A$102<$C$3+50-WEEKDAY($C$3,1))*($C$3<'Other Activities'!$A$4:$A$102),ROW('Other Activities'!$A$4:$A$102)),ROW(4:4))-3,7),\"\")","v":"Stouffville"},null,{"$f":"IFERROR(INDEX('Other Activities'!$A$4:$I$102,SMALL(IF(('Other Activities'!$A$4:$A$102<$C$3+50-WEEKDAY($C$3,1))*($C$3<'Other Activities'!$A$4:$A$102),ROW('Other Activities'!$A$4:$A$102)),ROW(4:4))-3,8),\"\")","v":"Civvies"},{"$f":"IFERROR(INDEX('Other Activities'!$A$4:$I$102,SMALL(IF(('Other Activities'!$A$4:$A$102<$C$3+50-WEEKDAY($C$3,1))*($C$3<'Other Activities'!$A$4:$A$102),ROW('Other Activities'!$A$4:$A$102)),ROW(4:4))-3,9),\"\")","v":"2Lt Chen"}]
[{"$f":"IFERROR(INDEX('Other Activities'!$A$4:$I$102,SMALL(IF(('Other Activities'!$A$4:$A$102<$C$3+50-WEEKDAY($C$3,1))*($C$3<'Other Activities'!$A$4:$A$102),ROW('Other Activities'!$A$4:$A$102)),ROW(5:5))-3,3),\"\")","v":""},{"$f":"IFERROR(INDEX('Other Activities'!$A$4:$I$102,SMALL(IF(('Other Activities'!$A$4:$A$102<$C$3+50-WEEKDAY($C$3,1))*($C$3<'Other Activities'!$A$4:$A$102),ROW('Other Activities'!$A$4:$A$102)),ROW(5:5))-3,1),\"\")","v":""},{"$f":"IFERROR(INDEX('Other Activities'!$A$4:$I$102,SMALL(IF(('Other Activities'!$A$4:$A$102<$C$3+50-WEEKDAY($C$3,1))*($C$3<'Other Activities'!$A$4:$A$102),ROW('Other Activities'!$A$4:$A$102)),ROW(5:5))-3,5),\"\")","v":""},{"$f":"IFERROR(INDEX('Other Activities'!$A$4:$I$102,SMALL(IF(('Other Activities'!$A$4:$A$102<$C$3+50-WEEKDAY($C$3,1))*($C$3<'Other Activities'!$A$4:$A$102),ROW('Other Activities'!$A$4:$A$102)),ROW(5:5))-3,4),\"\")","v":""},{"$f":"IFERROR(INDEX('Other Activities'!$A$4:$I$102,SMALL(IF(('Other Activities'!$A$4:$A$102<$C$3+50-WEEKDAY($C$3,1))*($C$3<'Other Activities'!$A$4:$A$102),ROW('Other Activities'!$A$4:$A$102)),ROW(5:5))-3,6),\"\")","v":""},null,null,{"$f":"IFERROR(INDEX('Other Activities'!$A$4:$I$102,SMALL(IF(('Other Activities'!$A$4:$A$102<$C$3+50-WEEKDAY($C$3,1))*($C$3<'Other Activities'!$A$4:$A$102),ROW('Other Activities'!$A$4:$A$102)),ROW(5:5))-3,7),\"\")","v":""},null,{"$f":"IFERROR(INDEX('Other Activities'!$A$4:$I$102,SMALL(IF(('Other Activities'!$A$4:$A$102<$C$3+50-WEEKDAY($C$3,1))*($C$3<'Other Activities'!$A$4:$A$102),ROW('Other Activities'!$A$4:$A$102)),ROW(5:5))-3,8),\"\")","v":""},{"$f":"IFERROR(INDEX('Other Activities'!$A$4:$I$102,SMALL(IF(('Other Activities'!$A$4:$A$102<$C$3+50-WEEKDAY($C$3,1))*($C$3<'Other Activities'!$A$4:$A$102),ROW('Other Activities'!$A$4:$A$102)),ROW(5:5))-3,9),\"\")","v":""}]
[{"$f":"IFERROR(INDEX('Other Activities'!$A$4:$I$102,SMALL(IF(('Other Activities'!$A$4:$A$102<$C$3+50-WEEKDAY($C$3,1))*($C$3<'Other Activities'!$A$4:$A$102),ROW('Other Activities'!$A$4:$A$102)),ROW(6:6))-3,3),\"\")","v":""},{"$f":"IFERROR(INDEX('Other Activities'!$A$4:$I$102,SMALL(IF(('Other Activities'!$A$4:$A$102<$C$3+50-WEEKDAY($C$3,1))*($C$3<'Other Activities'!$A$4:$A$102),ROW('Other Activities'!$A$4:$A$102)),ROW(6:6))-3,1),\"\")","v":""},{"$f":"IFERROR(INDEX('Other Activities'!$A$4:$I$102,SMALL(IF(('Other Activities'!$A$4:$A$102<$C$3+50-WEEKDAY($C$3,1))*($C$3<'Other Activities'!$A$4:$A$102),ROW('Other Activities'!$A$4:$A$102)),ROW(6:6))-3,5),\"\")","v":""},{"$f":"IFERROR(INDEX('Other Activities'!$A$4:$I$102,SMALL(IF(('Other Activities'!$A$4:$A$102<$C$3+50-WEEKDAY($C$3,1))*($C$3<'Other Activities'!$A$4:$A$102),ROW('Other Activities'!$A$4:$A$102)),ROW(6:6))-3,4),\"\")","v":""},{"$f":"IFERROR(INDEX('Other Activities'!$A$4:$I$102,SMALL(IF(('Other Activities'!$A$4:$A$102<$C$3+50-WEEKDAY($C$3,1))*($C$3<'Other Activities'!$A$4:$A$102),ROW('Other Activities'!$A$4:$A$102)),ROW(6:6))-3,6),\"\")","v":""},null,null,{"$f":"IFERROR(INDEX('Other Activities'!$A$4:$I$102,SMALL(IF(('Other Activities'!$A$4:$A$102<$C$3+50-WEEKDAY($C$3,1))*($C$3<'Other Activities'!$A$4:$A$102),ROW('Other Activities'!$A$4:$A$102)),ROW(6:6))-3,7),\"\")","v":""},null,{"$f":"IFERROR(INDEX('Other Activities'!$A$4:$I$102,SMALL(IF(('Other Activities'!$A$4:$A$102<$C$3+50-WEEKDAY($C$3,1))*($C$3<'Other Activities'!$A$4:$A$102),ROW('Other Activities'!$A$4:$A$102)),ROW(6:6))-3,8),\"\")","v":""},{"$f":"IFERROR(INDEX('Other Activities'!$A$4:$I$102,SMALL(IF(('Other Activities'!$A$4:$A$102<$C$3+50-WEEKDAY($C$3,1))*($C$3<'Other Activities'!$A$4:$A$102),ROW('Other Activities'!$A$4:$A$102)),ROW(6:6))-3,9),\"\")","v":""}]
[{"$f":"IFERROR(INDEX('Other Activities'!$A$4:$I$102,SMALL(IF(('Other Activities'!$A$4:$A$102<$C$3+50-WEEKDAY($C$3,1))*($C$3<'Other Activities'!$A$4:$A$102),ROW('Other Activities'!$A$4:$A$102)),ROW(7:7))-3,3),\"\")","v":""},{"$f":"IFERROR(INDEX('Other Activities'!$A$4:$I$102,SMALL(IF(('Other Activities'!$A$4:$A$102<$C$3+50-WEEKDAY($C$3,1))*($C$3<'Other Activities'!$A$4:$A$102),ROW('Other Activities'!$A$4:$A$102)),ROW(7:7))-3,1),\"\")","v":""},{"$f":"IFERROR(INDEX('Other Activities'!$A$4:$I$102,SMALL(IF(('Other Activities'!$A$4:$A$102<$C$3+50-WEEKDAY($C$3,1))*($C$3<'Other Activities'!$A$4:$A$102),ROW('Other Activities'!$A$4:$A$102)),ROW(7:7))-3,5),\"\")","v":""},{"$f":"IFERROR(INDEX('Other Activities'!$A$4:$I$102,SMALL(IF(('Other Activities'!$A$4:$A$102<$C$3+50-WEEKDAY($C$3,1))*($C$3<'Other Activities'!$A$4:$A$102),ROW('Other Activities'!$A$4:$A$102)),ROW(7:7))-3,4),\"\")","v":""},{"$f":"IFERROR(INDEX('Other Activities'!$A$4:$I$102,SMALL(IF(('Other Activities'!$A$4:$A$102<$C$3+50-WEEKDAY($C$3,1))*($C$3<'Other Activities'!$A$4:$A$102),ROW('Other Activities'!$A$4:$A$102)),ROW(7:7))-3,6),\"\")","v":""},null,null,{"$f":"IFERROR(INDEX('Other Activities'!$A$4:$I$102,SMALL(IF(('Other Activities'!$A$4:$A$102<$C$3+50-WEEKDAY($C$3,1))*($C$3<'Other Activities'!$A$4:$A$102),ROW('Other Activities'!$A$4:$A$102)),ROW(7:7))-3,7),\"\")","v":""},null,{"$f":"IFERROR(INDEX('Other Activities'!$A$4:$I$102,SMALL(IF(('Other Activities'!$A$4:$A$102<$C$3+50-WEEKDAY($C$3,1))*($C$3<'Other Activities'!$A$4:$A$102),ROW('Other Activities'!$A$4:$A$102)),ROW(7:7))-3,8),\"\")","v":""},{"$f":"IFERROR(INDEX('Other Activities'!$A$4:$I$102,SMALL(IF(('Other Activities'!$A$4:$A$102<$C$3+50-WEEKDAY($C$3,1))*($C$3<'Other Activities'!$A$4:$A$102),ROW('Other Activities'!$A$4:$A$102)),ROW(7:7))-3,9),\"\")","v":""}]
[{"$f":"IFERROR(INDEX('Other Activities'!$A$4:$I$102,SMALL(IF(('Other Activities'!$A$4:$A$102<$C$3+50-WEEKDAY($C$3,1))*($C$3<'Other Activities'!$A$4:$A$102),ROW('Other Activities'!$A$4:$A$102)),ROW(8:8))-3,3),\"\")","v":""},{"$f":"IFERROR(INDEX('Other Activities'!$A$4:$I$102,SMALL(IF(('Other Activities'!$A$4:$A$102<$C$3+50-WEEKDAY($C$3,1))*($C$3<'Other Activities'!$A$4:$A$102),ROW('Other Activities'!$A$4:$A$102)),ROW(8:8))-3,1),\"\")","v":""},{"$f":"IFERROR(INDEX('Other Activities'!$A$4:$I$102,SMALL(IF(('Other Activities'!$A$4:$A$102<$C$3+50-WEEKDAY($C$3,1))*($C$3<'Other Activities'!$A$4:$A$102),ROW('Other Activities'!$A$4:$A$102)),ROW(8:8))-3,5),\"\")","v":""},{"$f":"IFERROR(INDEX('Other Activities'!$A$4:$I$102,SMALL(IF(('Other Activities'!$A$4:$A$102<$C$3+50-WEEKDAY($C$3,1))*($C$3<'Other Activities'!$A$4:$A$102),ROW('Other Activities'!$A$4:$A$102)),ROW(8:8))-3,4),\"\")","v":""},{"$f":"IFERROR(INDEX('Other Activities'!$A$4:$I$102,SMALL(IF(('Other Activities'!$A$4:$A$102<$C$3+50-WEEKDAY($C$3,1))*($C$3<'Other Activities'!$A$4:$A$102),ROW('Other Activities'!$A$4:$A$102)),ROW(8:8))-3,6),\"\")","v":""},null,null,{"$f":"IFERROR(INDEX('Other Activities'!$A$4:$I$102,SMALL(IF(('Other Activities'!$A$4:$A$102<$C$3+50-WEEKDAY($C$3,1))*($C$3<'Other Activities'!$A$4:$A$102),ROW('Other Activities'!$A$4:$A$102)),ROW(8:8))-3,7),\"\")","v":""},null,{"$f":"IFERROR(INDEX('Other Activities'!$A$4:$I$102,SMALL(IF(('Other Activities'!$A$4:$A$102<$C$3+50-WEEKDAY($C$3,1))*($C$3<'Other Activities'!$A$4:$A$102),ROW('Other Activities'!$A$4:$A$102)),ROW(8:8))-3,8),\"\")","v":""},{"$f":"IFERROR(INDEX('Other Activities'!$A$4:$I$102,SMALL(IF(('Other Activities'!$A$4:$A$102<$C$3+50-WEEKDAY($C$3,1))*($C$3<'Other Activities'!$A$4:$A$102),ROW('Other Activities'!$A$4:$A$102)),ROW(8:8))-3,9),\"\")","v":""}]
[{"$f":"IFERROR(INDEX('Other Activities'!$A$4:$I$102,SMALL(IF(('Other Activities'!$A$4:$A$102<$C$3+50-WEEKDAY($C$3,1))*($C$3<'Other Activities'!$A$4:$A$102),ROW('Other Activities'!$A$4:$A$102)),ROW(9:9))-3,3),\"\")","v":""},{"$f":"IFERROR(INDEX('Other Activities'!$A$4:$I$102,SMALL(IF(('Other Activities'!$A$4:$A$102<$C$3+50-WEEKDAY($C$3,1))*($C$3<'Other Activities'!$A$4:$A$102),ROW('Other Activities'!$A$4:$A$102)),ROW(9:9))-3,1),\"\")","v":""},{"$f":"IFERROR(INDEX('Other Activities'!$A$4:$I$102,SMALL(IF(('Other Activities'!$A$4:$A$102<$C$3+50-WEEKDAY($C$3,1))*($C$3<'Other Activities'!$A$4:$A$102),ROW('Other Activities'!$A$4:$A$102)),ROW(9:9))-3,5),\"\")","v":""},{"$f":"IFERROR(INDEX('Other Activities'!$A$4:$I$102,SMALL(IF(('Other Activities'!$A$4:$A$102<$C$3+50-WEEKDAY($C$3,1))*($C$3<'Other Activities'!$A$4:$A$102),ROW('Other Activities'!$A$4:$A$102)),ROW(9:9))-3,4),\"\")","v":""},{"$f":"IFERROR(INDEX('Other Activities'!$A$4:$I$102,SMALL(IF(('Other Activities'!$A$4:$A$102<$C$3+50-WEEKDAY($C$3,1))*($C$3<'Other Activities'!$A$4:$A$102),ROW('Other Activities'!$A$4:$A$102)),ROW(9:9))-3,6),\"\")","v":""},null,null,{"$f":"IFERROR(INDEX('Other Activities'!$A$4:$I$102,SMALL(IF(('Other Activities'!$A$4:$A$102<$C$3+50-WEEKDAY($C$3,1))*($C$3<'Other Activities'!$A$4:$A$102),ROW('Other Activities'!$A$4:$A$102)),ROW(9:9))-3,7),\"\")","v":""},null,{"$f":"IFERROR(INDEX('Other Activities'!$A$4:$I$102,SMALL(IF(('Other Activities'!$A$4:$A$102<$C$3+50-WEEKDAY($C$3,1))*($C$3<'Other Activities'!$A$4:$A$102),ROW('Other Activities'!$A$4:$A$102)),ROW(9:9))-3,8),\"\")","v":""},{"$f":"IFERROR(INDEX('Other Activities'!$A$4:$I$102,SMALL(IF(('Other Activities'!$A$4:$A$102<$C$3+50-WEEKDAY($C$3,1))*($C$3<'Other Activities'!$A$4:$A$102),ROW('Other Activities'!$A$4:$A$102)),ROW(9:9))-3,9),\"\")","v":""}]
[{"$f":"IFERROR(INDEX('Other Activities'!$A$4:$I$102,SMALL(IF(('Other Activities'!$A$4:$A$102<$C$3+50-WEEKDAY($C$3,1))*($C$3<'Other Activities'!$A$4:$A$102),ROW('Other Activities'!$A$4:$A$102)),ROW(10:10))-3,3),\"\")","v":""},{"$f":"IFERROR(INDEX('Other Activities'!$A$4:$I$102,SMALL(IF(('Other Activities'!$A$4:$A$102<$C$3+50-WEEKDAY($C$3,1))*($C$3<'Other Activities'!$A$4:$A$102),ROW('Other Activities'!$A$4:$A$102)),ROW(10:10))-3,1),\"\")","v":""},{"$f":"IFERROR(INDEX('Other Activities'!$A$4:$I$102,SMALL(IF(('Other Activities'!$A$4:$A$102<$C$3+50-WEEKDAY($C$3,1))*($C$3<'Other Activities'!$A$4:$A$102),ROW('Other Activities'!$A$4:$A$102)),ROW(10:10))-3,5),\"\")","v":""},{"$f":"IFERROR(INDEX('Other Activities'!$A$4:$I$102,SMALL(IF(('Other Activities'!$A$4:$A$102<$C$3+50-WEEKDAY($C$3,1))*($C$3<'Other Activities'!$A$4:$A$102),ROW('Other Activities'!$A$4:$A$102)),ROW(10:10))-3,4),\"\")","v":""},{"$f":"IFERROR(INDEX('Other Activities'!$A$4:$I$102,SMALL(IF(('Other Activities'!$A$4:$A$102<$C$3+50-WEEKDAY($C$3,1))*($C$3<'Other Activities'!$A$4:$A$102),ROW('Other Activities'!$A$4:$A$102)),ROW(10:10))-3,6),\"\")","v":""},null,null,{"$f":"IFERROR(INDEX('Other Activities'!$A$4:$I$102,SMALL(IF(('Other Activities'!$A$4:$A$102<$C$3+50-WEEKDAY($C$3,1))*($C$3<'Other Activities'!$A$4:$A$102),ROW('Other Activities'!$A$4:$A$102)),ROW(10:10))-3,7),\"\")","v":""},null,{"$f":"IFERROR(INDEX('Other Activities'!$A$4:$I$102,SMALL(IF(('Other Activities'!$A$4:$A$102<$C$3+50-WEEKDAY($C$3,1))*($C$3<'Other Activities'!$A$4:$A$102),ROW('Other Activities'!$A$4:$A$102)),ROW(10:10))-3,8),\"\")","v":""},{"$f":"IFERROR(INDEX('Other Activities'!$A$4:$I$102,SMALL(IF(('Other Activities'!$A$4:$A$102<$C$3+50-WEEKDAY($C$3,1))*($C$3<'Other Activities'!$A$4:$A$102),ROW('Other Activities'!$A$4:$A$102)),ROW(10:10))-3,9),\"\")","v":""}]
[]
[]
[]
[]
[]
[]
["Notes"]
{"$rows_empty":30}
[{"$f":"'Unit Info'!$B$18","v":"Roger Carlsen, CD"}]
[{"$f":"'Unit Info'!$B$19","v":"Captain"}]
["Commanding Officer"]